sbuild (Debian sbuild) 0.88.2 (16 January 2025) on carme.larted.org.uk

+==============================================================================+
| libbio-eutilities-perl 1.77-2 (amd64)        Thu, 23 Jan 2025 08:07:29 +0000 |
+==============================================================================+

Package: libbio-eutilities-perl
Version: 1.77-2
Source Version: 1.77-2
Distribution: sid
Machine Architecture: amd64
Host Architecture: amd64
Build Architecture: amd64
Build Type: full

I: Setting up the chroot...
I: Creating chroot session...
I: Setting up log color...

+------------------------------------------------------------------------------+
| Chroot Setup Commands                        Thu, 23 Jan 2025 08:07:29 +0000 |
+------------------------------------------------------------------------------+


/usr/share/debomatic/sbuildcommands/chroot-setup-commands/dpkg-speedup libbio-eutilities-perl_1.77-2 sid amd64
--------------------------------------------------------------------------------------------------------------


I: Finished running '/usr/share/debomatic/sbuildcommands/chroot-setup-commands/dpkg-speedup libbio-eutilities-perl_1.77-2 sid amd64'.

Finished processing commands.
--------------------------------------------------------------------------------
I: Setting up apt archive...

+------------------------------------------------------------------------------+
| Update chroot                                Thu, 23 Jan 2025 08:07:30 +0000 |
+------------------------------------------------------------------------------+

Hit:1 http://deb.debian.org/debian unstable InRelease
Hit:2 http://deb.debian.org/debian sid InRelease
Reading package lists...
Reading package lists...
Building dependency tree...
Reading state information...
Calculating upgrade...
0 upgraded, 0 newly installed, 0 to remove and 0 not upgraded.

+------------------------------------------------------------------------------+
| Fetch source files                           Thu, 23 Jan 2025 08:07:31 +0000 |
+------------------------------------------------------------------------------+


Local sources
-------------

/srv/debomatic/incoming/libbio-eutilities-perl_1.77-2.dsc exists in /srv/debomatic/incoming; copying to chroot

+------------------------------------------------------------------------------+
| Install package build dependencies           Thu, 23 Jan 2025 08:07:31 +0000 |
+------------------------------------------------------------------------------+


Setup apt archive
-----------------

Merged Build-Depends: debhelper-compat (= 13), build-essential, libbio-asn1-entrezgene-perl, libbio-perl-perl, libhttp-message-perl, libtext-csv-perl, liburi-perl, libwww-perl, libxml-simple-perl, perl
Filtered Build-Depends: debhelper-compat (= 13), build-essential, libbio-asn1-entrezgene-perl, libbio-perl-perl, libhttp-message-perl, libtext-csv-perl, liburi-perl, libwww-perl, libxml-simple-perl, perl
dpkg-deb: building package 'sbuild-build-depends-main-dummy' in '/build/libbio-eutilities-perl-dg2Fbv/resolver-iw2s3W/apt_archive/sbuild-build-depends-main-dummy.deb'.
Ign:1 copy:/build/libbio-eutilities-perl-dg2Fbv/resolver-iw2s3W/apt_archive ./ InRelease
Get:2 copy:/build/libbio-eutilities-perl-dg2Fbv/resolver-iw2s3W/apt_archive ./ Release [609 B]
Ign:3 copy:/build/libbio-eutilities-perl-dg2Fbv/resolver-iw2s3W/apt_archive ./ Release.gpg
Get:4 copy:/build/libbio-eutilities-perl-dg2Fbv/resolver-iw2s3W/apt_archive ./ Sources [836 B]
Get:5 copy:/build/libbio-eutilities-perl-dg2Fbv/resolver-iw2s3W/apt_archive ./ Packages [778 B]
Fetched 2223 B in 0s (0 B/s)
Reading package lists...
Reading package lists...

Install main build dependencies (apt-based resolver)
----------------------------------------------------

Installing build dependencies
Reading package lists...
Building dependency tree...
Reading state information...
The following additional packages will be installed:
  autoconf automake autopoint autotools-dev bsdextrautils ca-certificates
  debhelper dh-autoreconf dh-strip-nondeterminism dwz file gettext
  gettext-base groff-base intltool-debian libarchive-zip-perl
  libbio-asn1-entrezgene-perl libbio-cluster-perl libbio-perl-perl
  libbio-variation-perl libclone-perl libdata-stag-perl libdebhelper-perl
  libelf1t64 libencode-locale-perl libexpat1 libfile-listing-perl
  libfile-stripnondeterminism-perl libhtml-parser-perl libhtml-tagset-perl
  libhtml-tree-perl libhttp-cookies-perl libhttp-date-perl
  libhttp-message-perl libhttp-negotiate-perl libicu72 libio-html-perl
  libio-socket-ssl-perl libio-string-perl liblwp-mediatypes-perl
  liblwp-protocol-https-perl libmagic-mgc libmagic1t64 libnet-http-perl
  libnet-ssleay-perl libpipeline1 libproc2-0 libtext-charwidth-perl
  libtext-csv-perl libtext-wrapi18n-perl libtimedate-perl libtool
  libtry-tiny-perl libuchardet0 liburi-perl libwww-perl libwww-robotrules-perl
  libxml-libxml-perl libxml-namespacesupport-perl libxml-parser-perl
  libxml-sax-base-perl libxml-sax-perl libxml-simple-perl libxml-twig-perl
  libxml-writer-perl libxml2 m4 man-db netbase openssl perl-openssl-defaults
  po-debconf procps sensible-utils ucf
Suggested packages:
  autoconf-archive gnu-standards autoconf-doc dh-make gettext-doc
  libasprintf-dev libgettextpo-dev groff bioperl libxml-sax-expatxs-perl
  libdata-dump-perl libcrypt-ssleay-perl libtool-doc gfortran
  | fortran95-compiler gcj-jdk libsub-name-perl libbusiness-isbn-perl
  libmime-base32-perl libregexp-ipv6-perl libauthen-ntlm-perl
  libunicode-map8-perl libunicode-string-perl xml-twig-tools m4-doc apparmor
  less www-browser libmail-box-perl
Recommended packages:
  curl | wget | lynx bioperl-run | libbio-perl-run-perl libace-perl
  libalgorithm-munkres-perl libarray-compare-perl libconvert-binary-c-perl
  libdbd-sqlite3-perl libdbd-mysql-perl libdbd-pg-perl libgd-perl
  libgraph-perl libgraphviz-perl libhtml-tableextract-perl
  liblist-moreutils-perl libpostscript-perl libset-scalar-perl
  libsoap-lite-perl libsort-naturally-perl libspreadsheet-parseexcel-perl
  libspreadsheet-writeexcel-perl libsvg-perl libsvg-graph-perl
  libxml-dom-xpath-perl libxml-sax-writer-perl perl-tk libgd-gd2-perl
  | libgd-gd2-noxpm-perl libxml-libxslt-perl libmldbm-perl libxml-perl
  libarchive-cpio-perl libhtml-format-perl libio-compress-brotli-perl
  libtext-csv-xs-perl libltdl-dev libdata-dump-perl libhtml-form-perl
  libhttp-daemon-perl libmailtools-perl libxml-sax-expat-perl
  libtext-iconv-perl libtie-ixhash-perl libxml-xpathengine-perl
  | libxml-xpath-perl libmail-sendmail-perl psmisc linux-sysctl-defaults
The following NEW packages will be installed:
  autoconf automake autopoint autotools-dev bsdextrautils ca-certificates
  debhelper dh-autoreconf dh-strip-nondeterminism dwz file gettext
  gettext-base groff-base intltool-debian libarchive-zip-perl
  libbio-asn1-entrezgene-perl libbio-cluster-perl libbio-perl-perl
  libbio-variation-perl libclone-perl libdata-stag-perl libdebhelper-perl
  libelf1t64 libencode-locale-perl libexpat1 libfile-listing-perl
  libfile-stripnondeterminism-perl libhtml-parser-perl libhtml-tagset-perl
  libhtml-tree-perl libhttp-cookies-perl libhttp-date-perl
  libhttp-message-perl libhttp-negotiate-perl libicu72 libio-html-perl
  libio-socket-ssl-perl libio-string-perl liblwp-mediatypes-perl
  liblwp-protocol-https-perl libmagic-mgc libmagic1t64 libnet-http-perl
  libnet-ssleay-perl libpipeline1 libproc2-0 libtext-charwidth-perl
  libtext-csv-perl libtext-wrapi18n-perl libtimedate-perl libtool
  libtry-tiny-perl libuchardet0 liburi-perl libwww-perl libwww-robotrules-perl
  libxml-libxml-perl libxml-namespacesupport-perl libxml-parser-perl
  libxml-sax-base-perl libxml-sax-perl libxml-simple-perl libxml-twig-perl
  libxml-writer-perl libxml2 m4 man-db netbase openssl perl-openssl-defaults
  po-debconf procps sbuild-build-depends-main-dummy sensible-utils ucf
0 upgraded, 76 newly installed, 0 to remove and 0 not upgraded.
Need to get 28.5 MB of archives.
After this operation, 99.8 MB of additional disk space will be used.
Get:1 copy:/build/libbio-eutilities-perl-dg2Fbv/resolver-iw2s3W/apt_archive ./ sbuild-build-depends-main-dummy 0.invalid.0 [916 B]
Get:2 http://deb.debian.org/debian unstable/main amd64 netbase all 6.4 [12.8 kB]
Get:3 http://deb.debian.org/debian unstable/main amd64 libproc2-0 amd64 2:4.0.4-6 [64.8 kB]
Get:4 http://deb.debian.org/debian unstable/main amd64 procps amd64 2:4.0.4-6 [879 kB]
Get:5 http://deb.debian.org/debian unstable/main amd64 sensible-utils all 0.0.24 [24.8 kB]
Get:6 http://deb.debian.org/debian unstable/main amd64 openssl amd64 3.4.0-2 [1422 kB]
Get:7 http://deb.debian.org/debian unstable/main amd64 ca-certificates all 20241223 [164 kB]
Get:8 http://deb.debian.org/debian unstable/main amd64 libmagic-mgc amd64 1:5.45-3+b1 [314 kB]
Get:9 http://deb.debian.org/debian unstable/main amd64 libmagic1t64 amd64 1:5.45-3+b1 [108 kB]
Get:10 http://deb.debian.org/debian unstable/main amd64 file amd64 1:5.45-3+b1 [43.3 kB]
Get:11 http://deb.debian.org/debian unstable/main amd64 gettext-base amd64 0.23.1-1 [243 kB]
Get:12 http://deb.debian.org/debian unstable/main amd64 libuchardet0 amd64 0.0.8-1+b2 [68.9 kB]
Get:13 http://deb.debian.org/debian unstable/main amd64 groff-base amd64 1.23.0-7 [1185 kB]
Get:14 http://deb.debian.org/debian unstable/main amd64 bsdextrautils amd64 2.40.4-1 [92.2 kB]
Get:15 http://deb.debian.org/debian unstable/main amd64 libpipeline1 amd64 1.5.8-1 [42.0 kB]
Get:16 http://deb.debian.org/debian unstable/main amd64 man-db amd64 2.13.0-1 [1420 kB]
Get:17 http://deb.debian.org/debian unstable/main amd64 libtext-charwidth-perl amd64 0.04-11+b4 [9476 B]
Get:18 http://deb.debian.org/debian unstable/main amd64 libtext-wrapi18n-perl all 0.06-10 [8808 B]
Get:19 http://deb.debian.org/debian unstable/main amd64 ucf all 3.0048 [42.0 kB]
Get:20 http://deb.debian.org/debian unstable/main amd64 m4 amd64 1.4.19-5 [294 kB]
Get:21 http://deb.debian.org/debian unstable/main amd64 autoconf all 2.72-3 [493 kB]
Get:22 http://deb.debian.org/debian unstable/main amd64 autotools-dev all 20220109.1 [51.6 kB]
Get:23 http://deb.debian.org/debian unstable/main amd64 automake all 1:1.16.5-1.3 [823 kB]
Get:24 http://deb.debian.org/debian unstable/main amd64 autopoint all 0.23.1-1 [770 kB]
Get:25 http://deb.debian.org/debian unstable/main amd64 libdebhelper-perl all 13.24.1 [90.9 kB]
Get:26 http://deb.debian.org/debian unstable/main amd64 libtool all 2.5.4-2 [539 kB]
Get:27 http://deb.debian.org/debian unstable/main amd64 dh-autoreconf all 20 [17.1 kB]
Get:28 http://deb.debian.org/debian unstable/main amd64 libarchive-zip-perl all 1.68-1 [104 kB]
Get:29 http://deb.debian.org/debian unstable/main amd64 libfile-stripnondeterminism-perl all 1.14.1-1 [19.6 kB]
Get:30 http://deb.debian.org/debian unstable/main amd64 dh-strip-nondeterminism all 1.14.1-1 [8584 B]
Get:31 http://deb.debian.org/debian unstable/main amd64 libelf1t64 amd64 0.192-4 [189 kB]
Get:32 http://deb.debian.org/debian unstable/main amd64 dwz amd64 0.15-1+b1 [110 kB]
Get:33 http://deb.debian.org/debian unstable/main amd64 libicu72 amd64 72.1-6 [9421 kB]
Get:34 http://deb.debian.org/debian unstable/main amd64 libxml2 amd64 2.12.7+dfsg+really2.9.14-0.2+b1 [699 kB]
Get:35 http://deb.debian.org/debian unstable/main amd64 gettext amd64 0.23.1-1 [1680 kB]
Get:36 http://deb.debian.org/debian unstable/main amd64 intltool-debian all 0.35.0+20060710.6 [22.9 kB]
Get:37 http://deb.debian.org/debian unstable/main amd64 po-debconf all 1.0.21+nmu1 [248 kB]
Get:38 http://deb.debian.org/debian unstable/main amd64 debhelper all 13.24.1 [920 kB]
Get:39 http://deb.debian.org/debian unstable/main amd64 libio-string-perl all 1.08-4 [12.1 kB]
Get:40 http://deb.debian.org/debian unstable/main amd64 libdata-stag-perl all 0.14-3 [448 kB]
Get:41 http://deb.debian.org/debian unstable/main amd64 libbio-perl-perl all 1.7.8-1 [2603 kB]
Get:42 http://deb.debian.org/debian unstable/main amd64 libexpat1 amd64 2.6.4-1 [106 kB]
Get:43 http://deb.debian.org/debian unstable/main amd64 liburi-perl all 5.30-1 [105 kB]
Get:44 http://deb.debian.org/debian unstable/main amd64 libencode-locale-perl all 1.05-3 [12.9 kB]
Get:45 http://deb.debian.org/debian unstable/main amd64 libtimedate-perl all 2.3300-2 [39.3 kB]
Get:46 http://deb.debian.org/debian unstable/main amd64 libhttp-date-perl all 6.06-1 [10.7 kB]
Get:47 http://deb.debian.org/debian unstable/main amd64 libfile-listing-perl all 6.16-1 [12.4 kB]
Get:48 http://deb.debian.org/debian unstable/main amd64 libhtml-tagset-perl all 3.24-1 [14.7 kB]
Get:49 http://deb.debian.org/debian unstable/main amd64 libhtml-parser-perl amd64 3.83-1+b2 [99.7 kB]
Get:50 http://deb.debian.org/debian unstable/main amd64 libhtml-tree-perl all 5.07-3 [211 kB]
Get:51 http://deb.debian.org/debian unstable/main amd64 libclone-perl amd64 0.47-1+b1 [13.9 kB]
Get:52 http://deb.debian.org/debian unstable/main amd64 libio-html-perl all 1.004-3 [16.2 kB]
Get:53 http://deb.debian.org/debian unstable/main amd64 liblwp-mediatypes-perl all 6.04-2 [20.2 kB]
Get:54 http://deb.debian.org/debian unstable/main amd64 libhttp-message-perl all 7.00-2 [79.8 kB]
Get:55 http://deb.debian.org/debian unstable/main amd64 libhttp-cookies-perl all 6.11-1 [19.1 kB]
Get:56 http://deb.debian.org/debian unstable/main amd64 libhttp-negotiate-perl all 6.01-2 [13.1 kB]
Get:57 http://deb.debian.org/debian unstable/main amd64 perl-openssl-defaults amd64 7+b2 [6724 B]
Get:58 http://deb.debian.org/debian unstable/main amd64 libnet-ssleay-perl amd64 1.94-2 [339 kB]
Get:59 http://deb.debian.org/debian unstable/main amd64 libio-socket-ssl-perl all 2.089-1 [223 kB]
Get:60 http://deb.debian.org/debian unstable/main amd64 libnet-http-perl all 6.23-1 [23.9 kB]
Get:61 http://deb.debian.org/debian unstable/main amd64 liblwp-protocol-https-perl all 6.14-1 [10.8 kB]
Get:62 http://deb.debian.org/debian unstable/main amd64 libtry-tiny-perl all 0.32-1 [22.9 kB]
Get:63 http://deb.debian.org/debian unstable/main amd64 libwww-robotrules-perl all 6.02-1 [12.9 kB]
Get:64 http://deb.debian.org/debian unstable/main amd64 libwww-perl all 6.77-1 [183 kB]
Get:65 http://deb.debian.org/debian unstable/main amd64 libxml-parser-perl amd64 2.47-1+b3 [198 kB]
Get:66 http://deb.debian.org/debian unstable/main amd64 libxml-twig-perl all 1:3.52-3 [177 kB]
Get:67 http://deb.debian.org/debian unstable/main amd64 libxml-writer-perl all 0.900-2 [26.8 kB]
Get:68 http://deb.debian.org/debian unstable/main amd64 libbio-variation-perl all 1.7.5-3 [72.6 kB]
Get:69 http://deb.debian.org/debian unstable/main amd64 libxml-namespacesupport-perl all 1.12-2 [15.1 kB]
Get:70 http://deb.debian.org/debian unstable/main amd64 libxml-sax-base-perl all 1.09-3 [20.6 kB]
Get:71 http://deb.debian.org/debian unstable/main amd64 libxml-sax-perl all 1.02+dfsg-4 [53.4 kB]
Get:72 http://deb.debian.org/debian unstable/main amd64 libbio-cluster-perl all 1.7.3-6 [53.3 kB]
Get:73 http://deb.debian.org/debian unstable/main amd64 libbio-asn1-entrezgene-perl all 1.730-3 [46.3 kB]
Get:74 http://deb.debian.org/debian unstable/main amd64 libtext-csv-perl all 2.05-1 [115 kB]
Get:75 http://deb.debian.org/debian unstable/main amd64 libxml-libxml-perl amd64 2.0207+dfsg+really+2.0134-5+b1 [314 kB]
Get:76 http://deb.debian.org/debian unstable/main amd64 libxml-simple-perl all 2.25-2 [69.8 kB]
Preconfiguring packages ...
Fetched 28.5 MB in 0s (129 MB/s)
Selecting previously unselected package netbase.
(Reading database ... 23024 files and directories currently installed.)
Preparing to unpack .../00-netbase_6.4_all.deb ...
Unpacking netbase (6.4) ...
Selecting previously unselected package libproc2-0:amd64.
Preparing to unpack .../01-libproc2-0_2%3a4.0.4-6_amd64.deb ...
Unpacking libproc2-0:amd64 (2:4.0.4-6) ...
Selecting previously unselected package procps.
Preparing to unpack .../02-procps_2%3a4.0.4-6_amd64.deb ...
Unpacking procps (2:4.0.4-6) ...
Selecting previously unselected package sensible-utils.
Preparing to unpack .../03-sensible-utils_0.0.24_all.deb ...
Unpacking sensible-utils (0.0.24) ...
Selecting previously unselected package openssl.
Preparing to unpack .../04-openssl_3.4.0-2_amd64.deb ...
Unpacking openssl (3.4.0-2) ...
Selecting previously unselected package ca-certificates.
Preparing to unpack .../05-ca-certificates_20241223_all.deb ...
Unpacking ca-certificates (20241223) ...
Selecting previously unselected package libmagic-mgc.
Preparing to unpack .../06-libmagic-mgc_1%3a5.45-3+b1_amd64.deb ...
Unpacking libmagic-mgc (1:5.45-3+b1) ...
Selecting previously unselected package libmagic1t64:amd64.
Preparing to unpack .../07-libmagic1t64_1%3a5.45-3+b1_amd64.deb ...
Unpacking libmagic1t64:amd64 (1:5.45-3+b1) ...
Selecting previously unselected package file.
Preparing to unpack .../08-file_1%3a5.45-3+b1_amd64.deb ...
Unpacking file (1:5.45-3+b1) ...
Selecting previously unselected package gettext-base.
Preparing to unpack .../09-gettext-base_0.23.1-1_amd64.deb ...
Unpacking gettext-base (0.23.1-1) ...
Selecting previously unselected package libuchardet0:amd64.
Preparing to unpack .../10-libuchardet0_0.0.8-1+b2_amd64.deb ...
Unpacking libuchardet0:amd64 (0.0.8-1+b2) ...
Selecting previously unselected package groff-base.
Preparing to unpack .../11-groff-base_1.23.0-7_amd64.deb ...
Unpacking groff-base (1.23.0-7) ...
Selecting previously unselected package bsdextrautils.
Preparing to unpack .../12-bsdextrautils_2.40.4-1_amd64.deb ...
Unpacking bsdextrautils (2.40.4-1) ...
Selecting previously unselected package libpipeline1:amd64.
Preparing to unpack .../13-libpipeline1_1.5.8-1_amd64.deb ...
Unpacking libpipeline1:amd64 (1.5.8-1) ...
Selecting previously unselected package man-db.
Preparing to unpack .../14-man-db_2.13.0-1_amd64.deb ...
Unpacking man-db (2.13.0-1) ...
Selecting previously unselected package libtext-charwidth-perl:amd64.
Preparing to unpack .../15-libtext-charwidth-perl_0.04-11+b4_amd64.deb ...
Unpacking libtext-charwidth-perl:amd64 (0.04-11+b4) ...
Selecting previously unselected package libtext-wrapi18n-perl.
Preparing to unpack .../16-libtext-wrapi18n-perl_0.06-10_all.deb ...
Unpacking libtext-wrapi18n-perl (0.06-10) ...
Selecting previously unselected package ucf.
Preparing to unpack .../17-ucf_3.0048_all.deb ...
Moving old data out of the way
Unpacking ucf (3.0048) ...
Selecting previously unselected package m4.
Preparing to unpack .../18-m4_1.4.19-5_amd64.deb ...
Unpacking m4 (1.4.19-5) ...
Selecting previously unselected package autoconf.
Preparing to unpack .../19-autoconf_2.72-3_all.deb ...
Unpacking autoconf (2.72-3) ...
Selecting previously unselected package autotools-dev.
Preparing to unpack .../20-autotools-dev_20220109.1_all.deb ...
Unpacking autotools-dev (20220109.1) ...
Selecting previously unselected package automake.
Preparing to unpack .../21-automake_1%3a1.16.5-1.3_all.deb ...
Unpacking automake (1:1.16.5-1.3) ...
Selecting previously unselected package autopoint.
Preparing to unpack .../22-autopoint_0.23.1-1_all.deb ...
Unpacking autopoint (0.23.1-1) ...
Selecting previously unselected package libdebhelper-perl.
Preparing to unpack .../23-libdebhelper-perl_13.24.1_all.deb ...
Unpacking libdebhelper-perl (13.24.1) ...
Selecting previously unselected package libtool.
Preparing to unpack .../24-libtool_2.5.4-2_all.deb ...
Unpacking libtool (2.5.4-2) ...
Selecting previously unselected package dh-autoreconf.
Preparing to unpack .../25-dh-autoreconf_20_all.deb ...
Unpacking dh-autoreconf (20) ...
Selecting previously unselected package libarchive-zip-perl.
Preparing to unpack .../26-libarchive-zip-perl_1.68-1_all.deb ...
Unpacking libarchive-zip-perl (1.68-1) ...
Selecting previously unselected package libfile-stripnondeterminism-perl.
Preparing to unpack .../27-libfile-stripnondeterminism-perl_1.14.1-1_all.deb ...
Unpacking libfile-stripnondeterminism-perl (1.14.1-1) ...
Selecting previously unselected package dh-strip-nondeterminism.
Preparing to unpack .../28-dh-strip-nondeterminism_1.14.1-1_all.deb ...
Unpacking dh-strip-nondeterminism (1.14.1-1) ...
Selecting previously unselected package libelf1t64:amd64.
Preparing to unpack .../29-libelf1t64_0.192-4_amd64.deb ...
Unpacking libelf1t64:amd64 (0.192-4) ...
Selecting previously unselected package dwz.
Preparing to unpack .../30-dwz_0.15-1+b1_amd64.deb ...
Unpacking dwz (0.15-1+b1) ...
Selecting previously unselected package libicu72:amd64.
Preparing to unpack .../31-libicu72_72.1-6_amd64.deb ...
Unpacking libicu72:amd64 (72.1-6) ...
Selecting previously unselected package libxml2:amd64.
Preparing to unpack .../32-libxml2_2.12.7+dfsg+really2.9.14-0.2+b1_amd64.deb ...
Unpacking libxml2:amd64 (2.12.7+dfsg+really2.9.14-0.2+b1) ...
Selecting previously unselected package gettext.
Preparing to unpack .../33-gettext_0.23.1-1_amd64.deb ...
Unpacking gettext (0.23.1-1) ...
Selecting previously unselected package intltool-debian.
Preparing to unpack .../34-intltool-debian_0.35.0+20060710.6_all.deb ...
Unpacking intltool-debian (0.35.0+20060710.6) ...
Selecting previously unselected package po-debconf.
Preparing to unpack .../35-po-debconf_1.0.21+nmu1_all.deb ...
Unpacking po-debconf (1.0.21+nmu1) ...
Selecting previously unselected package debhelper.
Preparing to unpack .../36-debhelper_13.24.1_all.deb ...
Unpacking debhelper (13.24.1) ...
Selecting previously unselected package libio-string-perl.
Preparing to unpack .../37-libio-string-perl_1.08-4_all.deb ...
Unpacking libio-string-perl (1.08-4) ...
Selecting previously unselected package libdata-stag-perl.
Preparing to unpack .../38-libdata-stag-perl_0.14-3_all.deb ...
Unpacking libdata-stag-perl (0.14-3) ...
Selecting previously unselected package libbio-perl-perl.
Preparing to unpack .../39-libbio-perl-perl_1.7.8-1_all.deb ...
Unpacking libbio-perl-perl (1.7.8-1) ...
Selecting previously unselected package libexpat1:amd64.
Preparing to unpack .../40-libexpat1_2.6.4-1_amd64.deb ...
Unpacking libexpat1:amd64 (2.6.4-1) ...
Selecting previously unselected package liburi-perl.
Preparing to unpack .../41-liburi-perl_5.30-1_all.deb ...
Unpacking liburi-perl (5.30-1) ...
Selecting previously unselected package libencode-locale-perl.
Preparing to unpack .../42-libencode-locale-perl_1.05-3_all.deb ...
Unpacking libencode-locale-perl (1.05-3) ...
Selecting previously unselected package libtimedate-perl.
Preparing to unpack .../43-libtimedate-perl_2.3300-2_all.deb ...
Unpacking libtimedate-perl (2.3300-2) ...
Selecting previously unselected package libhttp-date-perl.
Preparing to unpack .../44-libhttp-date-perl_6.06-1_all.deb ...
Unpacking libhttp-date-perl (6.06-1) ...
Selecting previously unselected package libfile-listing-perl.
Preparing to unpack .../45-libfile-listing-perl_6.16-1_all.deb ...
Unpacking libfile-listing-perl (6.16-1) ...
Selecting previously unselected package libhtml-tagset-perl.
Preparing to unpack .../46-libhtml-tagset-perl_3.24-1_all.deb ...
Unpacking libhtml-tagset-perl (3.24-1) ...
Selecting previously unselected package libhtml-parser-perl:amd64.
Preparing to unpack .../47-libhtml-parser-perl_3.83-1+b2_amd64.deb ...
Unpacking libhtml-parser-perl:amd64 (3.83-1+b2) ...
Selecting previously unselected package libhtml-tree-perl.
Preparing to unpack .../48-libhtml-tree-perl_5.07-3_all.deb ...
Unpacking libhtml-tree-perl (5.07-3) ...
Selecting previously unselected package libclone-perl:amd64.
Preparing to unpack .../49-libclone-perl_0.47-1+b1_amd64.deb ...
Unpacking libclone-perl:amd64 (0.47-1+b1) ...
Selecting previously unselected package libio-html-perl.
Preparing to unpack .../50-libio-html-perl_1.004-3_all.deb ...
Unpacking libio-html-perl (1.004-3) ...
Selecting previously unselected package liblwp-mediatypes-perl.
Preparing to unpack .../51-liblwp-mediatypes-perl_6.04-2_all.deb ...
Unpacking liblwp-mediatypes-perl (6.04-2) ...
Selecting previously unselected package libhttp-message-perl.
Preparing to unpack .../52-libhttp-message-perl_7.00-2_all.deb ...
Unpacking libhttp-message-perl (7.00-2) ...
Selecting previously unselected package libhttp-cookies-perl.
Preparing to unpack .../53-libhttp-cookies-perl_6.11-1_all.deb ...
Unpacking libhttp-cookies-perl (6.11-1) ...
Selecting previously unselected package libhttp-negotiate-perl.
Preparing to unpack .../54-libhttp-negotiate-perl_6.01-2_all.deb ...
Unpacking libhttp-negotiate-perl (6.01-2) ...
Selecting previously unselected package perl-openssl-defaults:amd64.
Preparing to unpack .../55-perl-openssl-defaults_7+b2_amd64.deb ...
Unpacking perl-openssl-defaults:amd64 (7+b2) ...
Selecting previously unselected package libnet-ssleay-perl:amd64.
Preparing to unpack .../56-libnet-ssleay-perl_1.94-2_amd64.deb ...
Unpacking libnet-ssleay-perl:amd64 (1.94-2) ...
Selecting previously unselected package libio-socket-ssl-perl.
Preparing to unpack .../57-libio-socket-ssl-perl_2.089-1_all.deb ...
Unpacking libio-socket-ssl-perl (2.089-1) ...
Selecting previously unselected package libnet-http-perl.
Preparing to unpack .../58-libnet-http-perl_6.23-1_all.deb ...
Unpacking libnet-http-perl (6.23-1) ...
Selecting previously unselected package liblwp-protocol-https-perl.
Preparing to unpack .../59-liblwp-protocol-https-perl_6.14-1_all.deb ...
Unpacking liblwp-protocol-https-perl (6.14-1) ...
Selecting previously unselected package libtry-tiny-perl.
Preparing to unpack .../60-libtry-tiny-perl_0.32-1_all.deb ...
Unpacking libtry-tiny-perl (0.32-1) ...
Selecting previously unselected package libwww-robotrules-perl.
Preparing to unpack .../61-libwww-robotrules-perl_6.02-1_all.deb ...
Unpacking libwww-robotrules-perl (6.02-1) ...
Selecting previously unselected package libwww-perl.
Preparing to unpack .../62-libwww-perl_6.77-1_all.deb ...
Unpacking libwww-perl (6.77-1) ...
Selecting previously unselected package libxml-parser-perl.
Preparing to unpack .../63-libxml-parser-perl_2.47-1+b3_amd64.deb ...
Unpacking libxml-parser-perl (2.47-1+b3) ...
Selecting previously unselected package libxml-twig-perl.
Preparing to unpack .../64-libxml-twig-perl_1%3a3.52-3_all.deb ...
Unpacking libxml-twig-perl (1:3.52-3) ...
Selecting previously unselected package libxml-writer-perl.
Preparing to unpack .../65-libxml-writer-perl_0.900-2_all.deb ...
Unpacking libxml-writer-perl (0.900-2) ...
Selecting previously unselected package libbio-variation-perl.
Preparing to unpack .../66-libbio-variation-perl_1.7.5-3_all.deb ...
Unpacking libbio-variation-perl (1.7.5-3) ...
Selecting previously unselected package libxml-namespacesupport-perl.
Preparing to unpack .../67-libxml-namespacesupport-perl_1.12-2_all.deb ...
Unpacking libxml-namespacesupport-perl (1.12-2) ...
Selecting previously unselected package libxml-sax-base-perl.
Preparing to unpack .../68-libxml-sax-base-perl_1.09-3_all.deb ...
Unpacking libxml-sax-base-perl (1.09-3) ...
Selecting previously unselected package libxml-sax-perl.
Preparing to unpack .../69-libxml-sax-perl_1.02+dfsg-4_all.deb ...
Unpacking libxml-sax-perl (1.02+dfsg-4) ...
Selecting previously unselected package libbio-cluster-perl.
Preparing to unpack .../70-libbio-cluster-perl_1.7.3-6_all.deb ...
Unpacking libbio-cluster-perl (1.7.3-6) ...
Selecting previously unselected package libbio-asn1-entrezgene-perl.
Preparing to unpack .../71-libbio-asn1-entrezgene-perl_1.730-3_all.deb ...
Unpacking libbio-asn1-entrezgene-perl (1.730-3) ...
Selecting previously unselected package libtext-csv-perl.
Preparing to unpack .../72-libtext-csv-perl_2.05-1_all.deb ...
Unpacking libtext-csv-perl (2.05-1) ...
Selecting previously unselected package libxml-libxml-perl.
Preparing to unpack .../73-libxml-libxml-perl_2.0207+dfsg+really+2.0134-5+b1_amd64.deb ...
Unpacking libxml-libxml-perl (2.0207+dfsg+really+2.0134-5+b1) ...
Selecting previously unselected package libxml-simple-perl.
Preparing to unpack .../74-libxml-simple-perl_2.25-2_all.deb ...
Unpacking libxml-simple-perl (2.25-2) ...
Selecting previously unselected package sbuild-build-depends-main-dummy.
Preparing to unpack .../75-sbuild-build-depends-main-dummy_0.invalid.0_amd64.deb ...
Unpacking sbuild-build-depends-main-dummy (0.invalid.0) ...
Setting up libexpat1:amd64 (2.6.4-1) ...
Setting up libpipeline1:amd64 (1.5.8-1) ...
Setting up libtext-charwidth-perl:amd64 (0.04-11+b4) ...
Setting up libicu72:amd64 (72.1-6) ...
Setting up bsdextrautils (2.40.4-1) ...
Setting up libmagic-mgc (1:5.45-3+b1) ...
Setting up libclone-perl:amd64 (0.47-1+b1) ...
Setting up libarchive-zip-perl (1.68-1) ...
Setting up libhtml-tagset-perl (3.24-1) ...
Setting up libdebhelper-perl (13.24.1) ...
Setting up liblwp-mediatypes-perl (6.04-2) ...
Setting up libmagic1t64:amd64 (1:5.45-3+b1) ...
Setting up libtry-tiny-perl (0.32-1) ...
Setting up perl-openssl-defaults:amd64 (7+b2) ...
Setting up libxml-namespacesupport-perl (1.12-2) ...
Setting up gettext-base (0.23.1-1) ...
Setting up m4 (1.4.19-5) ...
Setting up libencode-locale-perl (1.05-3) ...
Setting up file (1:5.45-3+b1) ...
Setting up libtext-wrapi18n-perl (0.06-10) ...
Setting up libelf1t64:amd64 (0.192-4) ...
Setting up libxml-sax-base-perl (1.09-3) ...
Setting up libio-string-perl (1.08-4) ...
Setting up autotools-dev (20220109.1) ...
Setting up libxml-writer-perl (0.900-2) ...
Setting up libproc2-0:amd64 (2:4.0.4-6) ...
Setting up libio-html-perl (1.004-3) ...
Setting up autopoint (0.23.1-1) ...
Setting up autoconf (2.72-3) ...
Setting up libtimedate-perl (2.3300-2) ...
Setting up dwz (0.15-1+b1) ...
Setting up libdata-stag-perl (0.14-3) ...
Setting up sensible-utils (0.0.24) ...
Setting up libuchardet0:amd64 (0.0.8-1+b2) ...
Setting up procps (2:4.0.4-6) ...
Setting up netbase (6.4) ...

Configuration file '/etc/protocols'
 ==> File on system created by you or by a script.
 ==> File also in package provided by package maintainer.
 ==> Using current old file as you requested.

Configuration file '/etc/services'
 ==> File on system created by you or by a script.
 ==> File also in package provided by package maintainer.
 ==> Using current old file as you requested.
Setting up libbio-perl-perl (1.7.8-1) ...
Setting up openssl (3.4.0-2) ...
Setting up libxml2:amd64 (2.12.7+dfsg+really2.9.14-0.2+b1) ...
Setting up liburi-perl (5.30-1) ...
Setting up libtext-csv-perl (2.05-1) ...
Setting up libnet-ssleay-perl:amd64 (1.94-2) ...
Setting up automake (1:1.16.5-1.3) ...
update-alternatives: using /usr/bin/automake-1.16 to provide /usr/bin/automake (automake) in auto mode
Setting up libfile-stripnondeterminism-perl (1.14.1-1) ...
Setting up libhttp-date-perl (6.06-1) ...
Setting up gettext (0.23.1-1) ...
Setting up libfile-listing-perl (6.16-1) ...
Setting up libtool (2.5.4-2) ...
Setting up libnet-http-perl (6.23-1) ...
Setting up intltool-debian (0.35.0+20060710.6) ...
Setting up dh-autoreconf (20) ...
Setting up ca-certificates (20241223) ...
Updating certificates in /etc/ssl/certs...
152 added, 0 removed; done.
Setting up ucf (3.0048) ...
Setting up dh-strip-nondeterminism (1.14.1-1) ...
Setting up libwww-robotrules-perl (6.02-1) ...
Setting up groff-base (1.23.0-7) ...
Setting up libhtml-parser-perl:amd64 (3.83-1+b2) ...
Setting up libio-socket-ssl-perl (2.089-1) ...
Setting up libhttp-message-perl (7.00-2) ...
Setting up libhttp-negotiate-perl (6.01-2) ...
Setting up libhttp-cookies-perl (6.11-1) ...
Setting up po-debconf (1.0.21+nmu1) ...
Setting up libhtml-tree-perl (5.07-3) ...
Setting up man-db (2.13.0-1) ...
Not building database; man-db/auto-update is not 'true'.
Setting up libxml-sax-perl (1.02+dfsg-4) ...
update-perl-sax-parsers: Registering Perl SAX parser XML::SAX::PurePerl with priority 10...
update-perl-sax-parsers: Updating overall Perl SAX parser modules info file...
Creating config file /etc/perl/XML/SAX/ParserDetails.ini with new version
Setting up libxml-libxml-perl (2.0207+dfsg+really+2.0134-5+b1) ...
update-perl-sax-parsers: Registering Perl SAX parser XML::LibXML::SAX::Parser with priority 50...
update-perl-sax-parsers: Registering Perl SAX parser XML::LibXML::SAX with priority 50...
update-perl-sax-parsers: Updating overall Perl SAX parser modules info file...
Setting up debhelper (13.24.1) ...
Setting up libxml-simple-perl (2.25-2) ...
Setting up liblwp-protocol-https-perl (6.14-1) ...
Setting up libwww-perl (6.77-1) ...
Setting up libxml-parser-perl (2.47-1+b3) ...
Setting up libxml-twig-perl (1:3.52-3) ...
Setting up libbio-variation-perl (1.7.5-3) ...
Setting up libbio-cluster-perl (1.7.3-6) ...
Setting up libbio-asn1-entrezgene-perl (1.730-3) ...
Setting up sbuild-build-depends-main-dummy (0.invalid.0) ...
Processing triggers for libc-bin (2.40-6) ...
Processing triggers for ca-certificates (20241223) ...
Updating certificates in /etc/ssl/certs...
0 added, 0 removed; done.
Running hooks in /etc/ca-certificates/update.d...
done.

+------------------------------------------------------------------------------+
| Check architectures                          Thu, 23 Jan 2025 08:07:40 +0000 |
+------------------------------------------------------------------------------+

Arch check ok (amd64 included in all)

+------------------------------------------------------------------------------+
| Build environment                            Thu, 23 Jan 2025 08:07:40 +0000 |
+------------------------------------------------------------------------------+

Kernel: Linux 6.11.10-amd64 #1 SMP PREEMPT_DYNAMIC Debian 6.11.10-1 (2024-11-23) amd64 (x86_64)
Toolchain package versions: binutils_2.43.90.20250122-1 dpkg-dev_1.22.14 g++-13_13.3.0-12 g++-14_14.2.0-14 gcc-13_13.3.0-12 gcc-14_14.2.0-14 libc6-dev_2.40-6 libstdc++-13-dev_13.3.0-12 libstdc++-14-dev_14.2.0-14 libstdc++6_14.2.0-14 linux-libc-dev_6.12.10-1
Package versions: adduser_3.137 apt_2.9.25 autoconf_2.72-3 automake_1:1.16.5-1.3 autopoint_0.23.1-1 autotools-dev_20220109.1 base-files_13.6 base-passwd_3.6.6 bash_5.2.37-1 binutils_2.43.90.20250122-1 binutils-common_2.43.90.20250122-1 binutils-gold_2.43.90.20250121-2+b1 binutils-gold-x86-64-linux-gnu_2.43.90.20250121-2+b1 binutils-x86-64-linux-gnu_2.43.90.20250122-1 bsdextrautils_2.40.4-1 bsdutils_1:2.40.4-1 build-essential_12.12 bzip2_1.0.8-6 ca-certificates_20241223 coreutils_9.5-1+b1 cpp_4:14.2.0-1 cpp-13_13.3.0-12 cpp-13-x86-64-linux-gnu_13.3.0-12 cpp-14_14.2.0-14 cpp-14-x86-64-linux-gnu_14.2.0-14 cpp-x86-64-linux-gnu_4:14.2.0-1 dash_0.5.12-11 debconf_1.5.89 debhelper_13.24.1 debian-archive-keyring_2023.4 debianutils_5.21 dh-autoreconf_20 dh-strip-nondeterminism_1.14.1-1 diffutils_1:3.10-2 dirmngr_2.2.46-1+b1 dpkg_1.22.14 dpkg-dev_1.22.14 dwz_0.15-1+b1 eatmydata_131-2 file_1:5.45-3+b1 findutils_4.10.0-3 g++_4:14.2.0-1 g++-13_13.3.0-12 g++-13-x86-64-linux-gnu_13.3.0-12 g++-14_14.2.0-14 g++-14-x86-64-linux-gnu_14.2.0-14 g++-x86-64-linux-gnu_4:14.2.0-1 gcc_4:14.2.0-1 gcc-13_13.3.0-12 gcc-13-base_13.3.0-12 gcc-13-x86-64-linux-gnu_13.3.0-12 gcc-14_14.2.0-14 gcc-14-base_14.2.0-14 gcc-14-x86-64-linux-gnu_14.2.0-14 gcc-x86-64-linux-gnu_4:14.2.0-1 gettext_0.23.1-1 gettext-base_0.23.1-1 gnupg_2.2.46-1 gnupg-l10n_2.2.46-1 gnupg-utils_2.2.46-1+b1 gpg_2.2.46-1+b1 gpg-agent_2.2.46-1+b1 gpg-wks-client_2.2.46-1+b1 gpgconf_2.2.46-1+b1 gpgsm_2.2.46-1+b1 gpgv_2.2.46-1+b1 grep_3.11-4 groff-base_1.23.0-7 gzip_1.13-1 hostname_3.25 init-system-helpers_1.68 intltool-debian_0.35.0+20060710.6 libacl1_2.3.2-2+b1 libapt-pkg6.0t64_2.9.25 libarchive-zip-perl_1.68-1 libasan8_14.2.0-14 libassuan0_2.5.6-1+b1 libassuan9_3.0.1-2 libatomic1_14.2.0-14 libattr1_1:2.5.2-2 libaudit-common_1:4.0.2-2 libaudit1_1:4.0.2-2+b1 libbinutils_2.43.90.20250122-1 libbio-asn1-entrezgene-perl_1.730-3 libbio-cluster-perl_1.7.3-6 libbio-perl-perl_1.7.8-1 libbio-variation-perl_1.7.5-3 libblkid1_2.40.4-1 libbsd0_0.12.2-2 libbz2-1.0_1.0.8-6 libc-bin_2.40-6 libc-dev-bin_2.40-6 libc-l10n_2.40-6 libc6_2.40-6 libc6-dev_2.40-6 libcap-ng0_0.8.5-4 libcap2_1:2.66-5+b1 libcc1-0_14.2.0-14 libclone-perl_0.47-1+b1 libcrypt-dev_1:4.4.38-1 libcrypt1_1:4.4.38-1 libctf-nobfd0_2.43.90.20250122-1 libctf0_2.43.90.20250122-1 libdata-stag-perl_0.14-3 libdb5.3t64_5.3.28+dfsg2-9 libdebconfclient0_0.277 libdebhelper-perl_13.24.1 libdpkg-perl_1.22.14 libeatmydata1_131-2+b1 libelf1t64_0.192-4 libencode-locale-perl_1.05-3 libexpat1_2.6.4-1 libffi8_3.4.6-1 libfile-listing-perl_6.16-1 libfile-stripnondeterminism-perl_1.14.1-1 libgcc-13-dev_13.3.0-12 libgcc-14-dev_14.2.0-14 libgcc-s1_14.2.0-14 libgcrypt20_1.11.0-7 libgdbm-compat4t64_1.24-2 libgdbm6t64_1.24-2 libgmp10_2:6.3.0+dfsg-3 libgnutls30t64_3.8.8-2 libgomp1_14.2.0-14 libgpg-error0_1.51-3 libgprofng0_2.43.90.20250122-1 libhogweed6t64_3.10-1+b1 libhtml-parser-perl_3.83-1+b2 libhtml-tagset-perl_3.24-1 libhtml-tree-perl_5.07-3 libhttp-cookies-perl_6.11-1 libhttp-date-perl_6.06-1 libhttp-message-perl_7.00-2 libhttp-negotiate-perl_6.01-2 libhwasan0_14.2.0-14 libicu72_72.1-6 libidn2-0_2.3.7-2+b1 libio-html-perl_1.004-3 libio-socket-ssl-perl_2.089-1 libio-string-perl_1.08-4 libisl23_0.27-1 libitm1_14.2.0-14 libjansson4_2.14-2+b3 libksba8_1.6.7-2+b1 libldap-2.5-0_2.5.19+dfsg-1 libldap2_2.6.9+dfsg-1 liblsan0_14.2.0-14 liblwp-mediatypes-perl_6.04-2 liblwp-protocol-https-perl_6.14-1 liblz4-1_1.9.4-4 liblzma5_5.6.3-1+b1 libmagic-mgc_1:5.45-3+b1 libmagic1t64_1:5.45-3+b1 libmd0_1.1.0-2+b1 libmount1_2.40.4-1 libmpc3_1.3.1-1+b3 libmpfr6_4.2.1-1+b2 libncursesw6_6.5-2+b1 libnet-http-perl_6.23-1 libnet-ssleay-perl_1.94-2 libnettle8t64_3.10-1+b1 libnpth0t64_1.8-2 libp11-kit0_0.25.5-3 libpam-modules_1.5.3-7+b1 libpam-modules-bin_1.5.3-7+b1 libpam-runtime_1.5.3-7 libpam0g_1.5.3-7+b1 libpcre2-8-0_10.44-5 libperl5.38t64_5.38.2-5 libperl5.40_5.40.0-8 libpipeline1_1.5.8-1 libproc2-0_2:4.0.4-6 libquadmath0_14.2.0-14 libreadline8t64_8.2-6 libsasl2-2_2.1.28+dfsg1-8+b1 libsasl2-modules-db_2.1.28+dfsg1-8+b1 libseccomp2_2.5.5-2 libselinux1_3.7-3+b1 libsemanage-common_3.7-2 libsemanage2_3.7-2+b1 libsepol2_3.7-1 libsframe1_2.43.90.20250122-1 libsmartcols1_2.40.4-1 libsqlite3-0_3.46.1-1 libssl3t64_3.4.0-2 libstdc++-13-dev_13.3.0-12 libstdc++-14-dev_14.2.0-14 libstdc++6_14.2.0-14 libsystemd0_257.2-2 libtasn1-6_4.19.0-3+b3 libtext-charwidth-perl_0.04-11+b4 libtext-csv-perl_2.05-1 libtext-wrapi18n-perl_0.06-10 libtimedate-perl_2.3300-2 libtinfo6_6.5-2+b1 libtool_2.5.4-2 libtry-tiny-perl_0.32-1 libtsan2_14.2.0-14 libubsan1_14.2.0-14 libuchardet0_0.0.8-1+b2 libudev1_257.2-2 libunistring5_1.3-1 liburi-perl_5.30-1 libuuid1_2.40.4-1 libwww-perl_6.77-1 libwww-robotrules-perl_6.02-1 libxml-libxml-perl_2.0207+dfsg+really+2.0134-5+b1 libxml-namespacesupport-perl_1.12-2 libxml-parser-perl_2.47-1+b3 libxml-sax-base-perl_1.09-3 libxml-sax-perl_1.02+dfsg-4 libxml-simple-perl_2.25-2 libxml-twig-perl_1:3.52-3 libxml-writer-perl_0.900-2 libxml2_2.12.7+dfsg+really2.9.14-0.2+b1 libxxhash0_0.8.3-2 libzstd1_1.5.6+dfsg-2 linux-libc-dev_6.12.10-1 locales-all_2.40-6 login_1:4.16.0-2+really2.40.4-1 login.defs_1:4.16.0-7 m4_1.4.19-5 make_4.4.1-1 man-db_2.13.0-1 mawk_1.3.4.20240905-1 ncurses-base_6.5-2 ncurses-bin_6.5-2+b1 netbase_6.4 openssl_3.4.0-2 openssl-provider-legacy_3.4.0-2 passwd_1:4.16.0-7 patch_2.7.6-7 perl_5.40.0-8 perl-base_5.40.0-8 perl-modules-5.38_5.38.2-5 perl-modules-5.40_5.40.0-8 perl-openssl-defaults_7+b2 pinentry-curses_1.3.1-2 po-debconf_1.0.21+nmu1 procps_2:4.0.4-6 readline-common_8.2-6 rpcsvc-proto_1.4.3-1 sbuild-build-depends-main-dummy_0.invalid.0 sed_4.9-2 sensible-utils_0.0.24 sqv_1.2.1-5 sysvinit-utils_3.13-1 tar_1.35+dfsg-3.1 ucf_3.0048 usr-is-merged_39+nmu2 util-linux_2.40.4-1 xz-utils_5.6.3-1+b1 zlib1g_1:1.3.dfsg+really1.3.1-1+b1

+------------------------------------------------------------------------------+
| Build                                        Thu, 23 Jan 2025 08:07:40 +0000 |
+------------------------------------------------------------------------------+


Unpack source
-------------

-----BEGIN PGP SIGNED MESSAGE-----
Hash: SHA512

Format: 3.0 (quilt)
Source: libbio-eutilities-perl
Binary: libbio-eutilities-perl
Architecture: all
Version: 1.77-2
Maintainer: Debian Perl Group <pkg-perl-maintainers@lists.alioth.debian.org>
Uploaders: Carnë Draug <carandraug+dev@gmail.com>
Homepage: https://metacpan.org/release/Bio-EUtilities
Standards-Version: 4.5.1
Vcs-Browser: https://salsa.debian.org/perl-team/modules/packages/libbio-eutilities-perl
Vcs-Git: https://salsa.debian.org/perl-team/modules/packages/libbio-eutilities-perl.git
Testsuite: autopkgtest-pkg-perl
Build-Depends: debhelper-compat (= 13)
Build-Depends-Indep: libbio-asn1-entrezgene-perl <!nocheck>, libbio-perl-perl <!nocheck>, libhttp-message-perl <!nocheck>, libtext-csv-perl <!nocheck>, liburi-perl <!nocheck>, libwww-perl <!nocheck>, libxml-simple-perl <!nocheck>, perl
Package-List:
 libbio-eutilities-perl deb perl optional arch=all
Checksums-Sha1:
 ee2a4960ae19eb212b9c9d8f81f149c80a9f9b65 98643 libbio-eutilities-perl_1.77.orig.tar.gz
 93110b21a4a4d05f3faf89e3cdfaffad45ed6a0e 5356 libbio-eutilities-perl_1.77-2.debian.tar.xz
Checksums-Sha256:
 4d018c8cbda73c3d71487165261a3dfc4e823f8e22747497f6a586d5ad6f737f 98643 libbio-eutilities-perl_1.77.orig.tar.gz
 6c611cf1f466f4e54266a3fe2f6852eeba3aa42973f0ec914625d719e7eb711b 5356 libbio-eutilities-perl_1.77-2.debian.tar.xz
Files:
 b4f862d0ec104628bce8e280d767adf0 98643 libbio-eutilities-perl_1.77.orig.tar.gz
 7f8a558f55cf02ce513d44f2211af53b 5356 libbio-eutilities-perl_1.77-2.debian.tar.xz

-----BEGIN PGP SIGNATURE-----

iQIzBAEBCgAdFiEEsjhixBXWVlpOhsvXV5wWDUyeI+gFAmNLcvcACgkQV5wWDUye
I+hx2g//ekO43cGa5ovp54hnEdgtsIHJ8OLZhh48XswLD5FMtd08XU5FQCL09TfA
dBL5VFzmr8yYsFA15bpO2V2Wp65yLK0E8/kJjDkLFtVit8DrLDNau0zMVuW5wZgP
YNQrfkcSF98/firWCmg0ybMDRkHdU/m4ka2w7FeJ4qcr0PvrTGg1emAQvabxaQJo
59dBqHx1awJEyD0bsGn9OPLp5N6+RjUnF+Uv1zvi4b9RAuAI2h8x0W7q5//TGnZ5
+UnuP8gpHHh9OJckBWM/hGjyqZRa0RMCnq94gCnWvIM1hR9UgQfN9vK3Q2LjISdu
VYyLPkCvcSe9719+cyEs4uxnihD74s8r4skCg54dB5trk6APwdh9C44MsWoncRI8
lGNmuc//87ROIr557WfOWtCWv3Zp05xEycU/xUSiVoqnQzTKQ7MtgBShPSOu9Xi1
3oUwwwCuQrVssXksLHxJOv4e9sAjNxpk1DCcAzKFlPS2KlvHF/4AD23YDWC7/YNl
DZ3TD20AB5XVIseKYF3J4HPSbHhF/+pKN7HJTfig1JV/4cAxmA8OnZCSBkZt8Eco
M3fN4pGbhnkvY3Q/JLM5tyGajWTvnqT5pueVavPEWPdAdTdoYhhen2o2Gb0KgtaR
1ZtClDLhrZkyev6nr3P2cl6SsVwTIyt/TPhPemFfsn+qtdwzEt4=
=XTsb
-----END PGP SIGNATURE-----

gpgv: Signature made Sun Oct 16 02:56:55 2022 UTC
gpgv:                using RSA key B23862C415D6565A4E86CBD7579C160D4C9E23E8
gpgv: Can't check signature: No public key
dpkg-source: warning: cannot verify inline signature for ./libbio-eutilities-perl_1.77-2.dsc: no acceptable signature found
dpkg-source: info: extracting libbio-eutilities-perl in /build/libbio-eutilities-perl-dg2Fbv/libbio-eutilities-perl-1.77
dpkg-source: info: unpacking libbio-eutilities-perl_1.77.orig.tar.gz
dpkg-source: info: unpacking libbio-eutilities-perl_1.77-2.debian.tar.xz
dpkg-source: info: using patch list from debian/patches/series
dpkg-source: info: applying inline-DTDs-on-testsuite
dpkg-source: info: applying autopkgtest-compile.patch

Check disk space
----------------

Sufficient free space for build

+------------------------------------------------------------------------------+
| Starting Timed Build Commands                Thu, 23 Jan 2025 08:07:40 +0000 |
+------------------------------------------------------------------------------+


/usr/share/debomatic/sbuildcommands/starting-build-commands/no-network libbio-eutilities-perl_1.77-2 sid amd64
--------------------------------------------------------------------------------------------------------------


I: Finished running '/usr/share/debomatic/sbuildcommands/starting-build-commands/no-network libbio-eutilities-perl_1.77-2 sid amd64'.

Finished processing commands.
--------------------------------------------------------------------------------

User Environment
----------------

APT_CONFIG=/var/lib/sbuild/apt.conf
HOME=/sbuild-nonexistent
LANG=en_GB.UTF-8
LANGUAGE=en_GB:en
LC_ALL=C.UTF-8
LD_LIBRARY_PATH=/usr/lib/libeatmydata
LD_PRELOAD=libeatmydata.so
LOGNAME=debomatic
PATH=/usr/local/sbin:/usr/local/bin:/usr/sbin:/usr/bin:/sbin:/bin:/usr/games
PWD=/build/libbio-eutilities-perl-dg2Fbv/libbio-eutilities-perl-1.77
SCHROOT_ALIAS_NAME=sid-amd64-debomatic
SCHROOT_CHROOT_NAME=sid-amd64-debomatic
SCHROOT_COMMAND=env
SCHROOT_GID=110
SCHROOT_GROUP=sbuild
SCHROOT_SESSION_ID=sid-amd64-debomatic-67e4be13-bb6f-4fb1-bd18-23120f0a6841
SCHROOT_UID=1002
SCHROOT_USER=debomatic
SHELL=/bin/sh
USER=debomatic

dpkg-buildpackage
-----------------

Command: dpkg-buildpackage --sanitize-env -us -uc -Zxz
dpkg-buildpackage: info: source package libbio-eutilities-perl
dpkg-buildpackage: info: source version 1.77-2
dpkg-buildpackage: info: source distribution unstable
dpkg-buildpackage: info: source changed by Jelmer Vernooij <jelmer@debian.org>
 dpkg-source -Zxz --before-build .
dpkg-buildpackage: info: host architecture amd64
 debian/rules clean
dh clean
   dh_clean
 dpkg-source -Zxz -b .
dpkg-source: info: using source format '3.0 (quilt)'
dpkg-source: info: building libbio-eutilities-perl using existing ./libbio-eutilities-perl_1.77.orig.tar.gz
dpkg-source: info: using patch list from debian/patches/series
dpkg-source: info: building libbio-eutilities-perl in libbio-eutilities-perl_1.77-2.debian.tar.xz
dpkg-source: info: building libbio-eutilities-perl in libbio-eutilities-perl_1.77-2.dsc
 debian/rules binary
dh binary
   dh_update_autotools_config
   dh_autoreconf
   dh_auto_configure
	/usr/bin/perl Makefile.PL INSTALLDIRS=vendor "OPTIMIZE=-g -O2 -Werror=implicit-function-declaration -ffile-prefix-map=/build/libbio-eutilities-perl-dg2Fbv/libbio-eutilities-perl-1.77=. -fstack-protector-strong -fstack-clash-protection -Wformat -Werror=format-security -fcf-protection -Wdate-time -D_FORTIFY_SOURCE=2" "LD=x86_64-linux-gnu-gcc -g -O2 -Werror=implicit-function-declaration -ffile-prefix-map=/build/libbio-eutilities-perl-dg2Fbv/libbio-eutilities-perl-1.77=. -fstack-protector-strong -fstack-clash-protection -Wformat -Werror=format-security -fcf-protection -Wl,-z,relro"
Checking if your kit is complete...
Looks good
Generating a Unix-style Makefile
Writing Makefile for Bio::EUtilities
Writing MYMETA.yml and MYMETA.json
   dh_auto_build
	make -j2
make[1]: Entering directory '/build/libbio-eutilities-perl-dg2Fbv/libbio-eutilities-perl-1.77'
cp lib/Bio/DB/EUtilities.pm blib/lib/Bio/DB/EUtilities.pm
cp lib/Bio/Tools/EUtilities/Link/LinkSet.pm blib/lib/Bio/Tools/EUtilities/Link/LinkSet.pm
cp lib/Bio/Tools/EUtilities/Summary/Item.pm blib/lib/Bio/Tools/EUtilities/Summary/Item.pm
cp lib/Bio/Tools/EUtilities/HistoryI.pm blib/lib/Bio/Tools/EUtilities/HistoryI.pm
cp lib/Bio/Tools/EUtilities/Info/LinkInfo.pm blib/lib/Bio/Tools/EUtilities/Info/LinkInfo.pm
cp lib/Bio/Tools/EUtilities/Query/GlobalQuery.pm blib/lib/Bio/Tools/EUtilities/Query/GlobalQuery.pm
cp lib/Bio/Tools/EUtilities/History.pm blib/lib/Bio/Tools/EUtilities/History.pm
cp lib/Bio/Tools/EUtilities/Link/UrlLink.pm blib/lib/Bio/Tools/EUtilities/Link/UrlLink.pm
cp lib/Bio/Tools/EUtilities/Info.pm blib/lib/Bio/Tools/EUtilities/Info.pm
cp lib/Bio/Tools/EUtilities/EUtilDataI.pm blib/lib/Bio/Tools/EUtilities/EUtilDataI.pm
cp lib/Bio/Tools/EUtilities/Link.pm blib/lib/Bio/Tools/EUtilities/Link.pm
cp lib/Bio/Tools/EUtilities/Query.pm blib/lib/Bio/Tools/EUtilities/Query.pm
cp lib/Bio/Tools/EUtilities/Summary.pm blib/lib/Bio/Tools/EUtilities/Summary.pm
cp lib/Bio/Tools/EUtilities.pm blib/lib/Bio/Tools/EUtilities.pm
cp lib/Bio/Tools/EUtilities/Summary/ItemContainerI.pm blib/lib/Bio/Tools/EUtilities/Summary/ItemContainerI.pm
cp lib/Bio/Tools/EUtilities/Summary/DocSum.pm blib/lib/Bio/Tools/EUtilities/Summary/DocSum.pm
cp lib/Bio/Tools/EUtilities/EUtilParameters.pm blib/lib/Bio/Tools/EUtilities/EUtilParameters.pm
cp lib/Bio/Tools/EUtilities/Info/FieldInfo.pm blib/lib/Bio/Tools/EUtilities/Info/FieldInfo.pm
cp lib/Bio/EUtilities.pm blib/lib/Bio/EUtilities.pm
cp bin/bp_einfo blib/script/bp_einfo
"/usr/bin/perl" -MExtUtils::MY -e 'MY->fixin(shift)' -- blib/script/bp_einfo
cp bin/bp_genbank_ref_extractor blib/script/bp_genbank_ref_extractor
"/usr/bin/perl" -MExtUtils::MY -e 'MY->fixin(shift)' -- blib/script/bp_genbank_ref_extractor
Manifying 2 pod documents
Manifying 19 pod documents
make[1]: Leaving directory '/build/libbio-eutilities-perl-dg2Fbv/libbio-eutilities-perl-1.77'
   dh_auto_test
	make -j2 test TEST_VERBOSE=1
make[1]: Entering directory '/build/libbio-eutilities-perl-dg2Fbv/libbio-eutilities-perl-1.77'
PERL_DL_NONLAZY=1 "/usr/bin/perl" "-MExtUtils::Command::MM" "-MTest::Harness" "-e" "undef *Test::Harness::Switches; test_harness(1, 'blib/lib', 'blib/arch')" t/*.t
t/00-compile.t .............. 
1..21
ok 1 - Bio/DB/EUtilities.pm loaded ok
ok 2 - Bio/EUtilities.pm loaded ok
ok 3 - Bio/Tools/EUtilities.pm loaded ok
ok 4 - Bio/Tools/EUtilities/EUtilDataI.pm loaded ok
ok 5 - Bio/Tools/EUtilities/EUtilParameters.pm loaded ok
ok 6 - Bio/Tools/EUtilities/History.pm loaded ok
ok 7 - Bio/Tools/EUtilities/HistoryI.pm loaded ok
ok 8 - Bio/Tools/EUtilities/Info.pm loaded ok
ok 9 - Bio/Tools/EUtilities/Info/FieldInfo.pm loaded ok
ok 10 - Bio/Tools/EUtilities/Info/LinkInfo.pm loaded ok
ok 11 - Bio/Tools/EUtilities/Link.pm loaded ok
ok 12 - Bio/Tools/EUtilities/Link/LinkSet.pm loaded ok
ok 13 - Bio/Tools/EUtilities/Link/UrlLink.pm loaded ok
ok 14 - Bio/Tools/EUtilities/Query.pm loaded ok
ok 15 - Bio/Tools/EUtilities/Query/GlobalQuery.pm loaded ok
ok 16 - Bio/Tools/EUtilities/Summary.pm loaded ok
ok 17 - Bio/Tools/EUtilities/Summary/DocSum.pm loaded ok
ok 18 - Bio/Tools/EUtilities/Summary/Item.pm loaded ok
ok 19 - Bio/Tools/EUtilities/Summary/ItemContainerI.pm loaded ok
ok 20 - bin/bp_einfo compiled ok
ok 21 - bin/bp_genbank_ref_extractor compiled ok
ok
t/author-eol.t .............. skipped: these tests are for testing by the author
t/author-mojibake.t ......... skipped: these tests are for testing by the author
t/author-no-tabs.t .......... skipped: these tests are for testing by the author
t/author-pod-syntax.t ....... skipped: these tests are for testing by the author
t/egquery.t ................. 
1..18
ok 1 - get_db
ok 2 - get_database
ok 3 - get_databases
ok 4 - get_term
ok 5 - get_count
ok 6 - get_count
ok 7 - get_count
ok 8 - get_GlobalQueries
ok 9 - get_term
ok 10 - get_term
ok 11 - get_term
ok 12 - get_term
ok 13 - get_term
ok 14 - get_term
ok 15 - get_term
ok 16 - get_term
ok 17 - get_term
ok 18 - get_term
ok
t/einfo.t ................... 
1..49
ok 1 - get_available_databases
ok 2 - get_databases
ok 3 - get_db
ok 4 - get_record_count
ok 5 - get_menu_name
ok 6 - get_last_update
ok 7 - get_description
ok 8 - FieldInfo
ok 9 - LinkInfo
ok 10 - get_db
ok 11 - get_dbs
ok 12 - get_record_count
ok 13 - get_menu_name
ok 14 - get_last_update
ok 15 - get_description
ok 16 - FieldInfo
ok 17 - get_term_count
ok 18 - get_field_name
ok 19 - get_field_code
ok 20 - get_field_description
ok 21 - is_date
ok 22 - is_singletoken
ok 23 - is_hierarchy
ok 24 - is_hidden
ok 25 - is_numerical
ok 26 - get_term_count
ok 27 - get_field_name
ok 28 - get_field_code
ok 29 - get_field_description
ok 30 - is_date
ok 31 - is_singletoken
ok 32 - is_hierarchy
ok 33 - is_hidden
ok 34 - is_numerical
ok 35 - LinkInfo
ok 36 - get_dbto
ok 37 - get_dbfrom
ok 38 - get_link_name
ok 39 - get_link_description
ok 40 - get_priority
ok 41 - get_html_tag
ok 42 - get_url
ok 43 - get_dbto
ok 44 - get_dbfrom
ok 45 - get_link_name
ok 46 - get_link_description
ok 47 - get_priority
ok 48 - get_html_tag
ok 49 - get_url
ok
choice/seq contains no opening bracket [Ln: 26, Col: 33]
XML::Simple called at /build/libbio-eutilities-perl-dg2Fbv/libbio-eutilities-perl-1.77/blib/lib/Bio/Tools/EUtilities.pm line 144.
# Looks like your test exited with 255 just after 1.
t/elink_acheck.t ............ 
1..128
ok 1 - An object of class 'Bio::Tools::EUtilities::Link' isa 'Bio::Tools::EUtilities::Link'
Dubious, test returned 255 (wstat 65280, 0xff00)
Failed 127/128 subtests 
choice/seq contains no opening bracket [Ln: 26, Col: 33]
XML::Simple called at /build/libbio-eutilities-perl-dg2Fbv/libbio-eutilities-perl-1.77/blib/lib/Bio/Tools/EUtilities.pm line 144.
# Looks like your test exited with 255 just after 1.
t/elink_lcheck.t ............ 
1..62
ok 1 - An object of class 'Bio::Tools::EUtilities::Link' isa 'Bio::Tools::EUtilities::Link'
Dubious, test returned 255 (wstat 65280, 0xff00)
Failed 61/62 subtests 
choice/seq contains no opening bracket [Ln: 26, Col: 33]
XML::Simple called at /build/libbio-eutilities-perl-dg2Fbv/libbio-eutilities-perl-1.77/blib/lib/Bio/Tools/EUtilities.pm line 144.
# Looks like your test exited with 255 just after 1.
t/elink_llinks.t ............ 
1..84
ok 1 - An object of class 'Bio::Tools::EUtilities::Link' isa 'Bio::Tools::EUtilities::Link'
Dubious, test returned 255 (wstat 65280, 0xff00)
Failed 83/84 subtests 
choice/seq contains no opening bracket [Ln: 26, Col: 33]
XML::Simple called at /build/libbio-eutilities-perl-dg2Fbv/libbio-eutilities-perl-1.77/blib/lib/Bio/Tools/EUtilities.pm line 144.
# Looks like your test exited with 255 just after 1.
t/elink_ncheck.t ............ 
1..58
ok 1 - An object of class 'Bio::Tools::EUtilities::Link' isa 'Bio::Tools::EUtilities::Link'
Dubious, test returned 255 (wstat 65280, 0xff00)
Failed 57/58 subtests 
choice/seq contains no opening bracket [Ln: 26, Col: 33]
XML::Simple called at /build/libbio-eutilities-perl-dg2Fbv/libbio-eutilities-perl-1.77/blib/lib/Bio/Tools/EUtilities.pm line 144.
# Looks like your test exited with 255 just after 1.
t/elink_neighbor.t .......... 
1..61
ok 1 - An object of class 'Bio::Tools::EUtilities::Link' isa 'Bio::Tools::EUtilities::Link'
Dubious, test returned 255 (wstat 65280, 0xff00)
Failed 60/61 subtests 
choice/seq contains no opening bracket [Ln: 26, Col: 33]
XML::Simple called at /build/libbio-eutilities-perl-dg2Fbv/libbio-eutilities-perl-1.77/blib/lib/Bio/Tools/EUtilities.pm line 144.
# Looks like your test exited with 255 just after 1.
t/elink_neighbor_history.t .. 
1..63
ok 1 - An object of class 'Bio::Tools::EUtilities::Link' isa 'Bio::Tools::EUtilities::Link'
Dubious, test returned 255 (wstat 65280, 0xff00)
Failed 62/63 subtests 
choice/seq contains no opening bracket [Ln: 26, Col: 33]
XML::Simple called at /build/libbio-eutilities-perl-dg2Fbv/libbio-eutilities-perl-1.77/blib/lib/Bio/Tools/EUtilities.pm line 144.
# Looks like your test exited with 255 just after 1.
t/elink_scores.t ............ 
1..56
ok 1 - An object of class 'Bio::Tools::EUtilities::Link' isa 'Bio::Tools::EUtilities::Link'
Dubious, test returned 255 (wstat 65280, 0xff00)
Failed 55/56 subtests 
t/epost.t ................... 
1..15
ok 1 - An object of class 'Bio::Tools::EUtilities::Query' isa 'Bio::Tools::EUtilities::EUtilDataI'
ok 2 - An object of class 'Bio::Tools::EUtilities::Query' isa 'Bio::Tools::EUtilities::Query'
ok 3 - eutil
ok 4 - datatype
ok 5 - An object of class 'Bio::Tools::EUtilities::History' isa 'Bio::Tools::EUtilities::HistoryI'
ok 6 - An object of class 'Bio::Tools::EUtilities::History' isa 'Bio::Tools::EUtilities::EUtilDataI'
ok 7 - eutil
ok 8 - eutil
ok 9 - get_webenv
ok 10 - get_query_key
ok 11 - history
ok 12 - get_database
ok 13 - get_ids
ok 14 - get_database
ok 15 - get_ids
ok
t/esearch.t ................. 
1..31
ok 1 - get_count
ok 2
ok 3 - get_ids
ok 4 - get_retstart
ok 5 - get_retmax
ok 6 - get_translation_from
ok 7 - get_translation_to
ok 8 - get_db
ok 9 - get_database
ok 10 - get_term
ok 11 - get_db
ok 12 - get_database
ok 13 - get_term
ok 14 - get_corrected_query
ok 15 - get_replaced_terms
ok 16 - get_count
ok 17 - An object of class 'Bio::Tools::EUtilities::History' isa 'Bio::Tools::EUtilities::HistoryI'
ok 18 - get_webenv
ok 19 - get_query_key
ok 20 - history
ok 21 - get_ids
ok 22 - get_retstart
ok 23 - get_retmax
ok 24 - get_translation_from
ok 25 - get_translation_to
ok 26 - get_db
ok 27 - get_database
ok 28 - get_term
ok 29 - get_corrected_query
ok 30 - get_replaced_terms
ok 31 - get_GlobalQueries
ok
t/espell.t .................. 
1..20
ok 1 - get_db
ok 2 - get_dbs
ok 3 - get_database
ok 4 - get_databases
ok 5 - get_term
ok 6 - get_corrected_query
ok 7 - get_replaced_terms
ok 8 - get_replaced_terms
ok 9 - get_count
ok 10
ok 11 - get_ids
ok 12 - get_retstart
ok 13 - get_retmax
ok 14 - get_translation_from
ok 15 - get_translation_to
ok 16 - get_db
ok 17 - get_dbs
ok 18 - get_database
ok 19 - get_databases
ok 20 - get_term
ok
choice/seq contains no opening bracket [Ln: 11, Col: 39]
XML::Simple called at /build/libbio-eutilities-perl-dg2Fbv/libbio-eutilities-perl-1.77/blib/lib/Bio/Tools/EUtilities.pm line 144.
# Looks like your test exited with 25 just after 1.
t/esummary.t ................ 
1..81
ok 1 - An object of class 'Bio::Tools::EUtilities::Summary' isa 'Bio::Tools::EUtilities::Summary'
Dubious, test returned 25 (wstat 6400, 0x1900)
Failed 80/81 subtests 
t/EUtilParameters.t ......... 
1..12
ok 1
ok 2 - An object of class 'HTTP::Request' isa 'HTTP::Request'
ok 3
ok 4
ok 5
ok 6
ok 7
ok 8
ok 9 - available_parameters
ok 10 - available_parameters
ok 11 - get_parameters
ok 12 - get_parameters
ok
t/release-EUtilities.t ...... skipped: these tests are for release candidate testing

Test Summary Report
-------------------
t/elink_acheck.t          (Wstat: 65280 (exited 255) Tests: 1 Failed: 0)
  Non-zero exit status: 255
  Parse errors: Bad plan.  You planned 128 tests but ran 1.
t/elink_lcheck.t          (Wstat: 65280 (exited 255) Tests: 1 Failed: 0)
  Non-zero exit status: 255
  Parse errors: Bad plan.  You planned 62 tests but ran 1.
t/elink_llinks.t          (Wstat: 65280 (exited 255) Tests: 1 Failed: 0)
  Non-zero exit status: 255
  Parse errors: Bad plan.  You planned 84 tests but ran 1.
t/elink_ncheck.t          (Wstat: 65280 (exited 255) Tests: 1 Failed: 0)
  Non-zero exit status: 255
  Parse errors: Bad plan.  You planned 58 tests but ran 1.
t/elink_neighbor.t        (Wstat: 65280 (exited 255) Tests: 1 Failed: 0)
  Non-zero exit status: 255
  Parse errors: Bad plan.  You planned 61 tests but ran 1.
t/elink_neighbor_history.t (Wstat: 65280 (exited 255) Tests: 1 Failed: 0)
  Non-zero exit status: 255
  Parse errors: Bad plan.  You planned 63 tests but ran 1.
t/elink_scores.t          (Wstat: 65280 (exited 255) Tests: 1 Failed: 0)
  Non-zero exit status: 255
  Parse errors: Bad plan.  You planned 56 tests but ran 1.
t/esummary.t              (Wstat: 6400 (exited 25) Tests: 1 Failed: 0)
  Non-zero exit status: 25
  Parse errors: Bad plan.  You planned 81 tests but ran 1.
Files=20, Tests=174,  3 wallclock secs ( 0.06 usr  0.03 sys +  2.43 cusr  0.62 csys =  3.14 CPU)
Result: FAIL
Failed 8/20 test programs. 0/174 subtests failed.
make[1]: *** [Makefile:983: test_dynamic] Error 255
make[1]: Leaving directory '/build/libbio-eutilities-perl-dg2Fbv/libbio-eutilities-perl-1.77'
dh_auto_test: error: make -j2 test TEST_VERBOSE=1 returned exit code 2
make: *** [debian/rules:4: binary] Error 25
dpkg-buildpackage: error: debian/rules binary subprocess returned exit status 2
--------------------------------------------------------------------------------
Build finished at 2025-01-23T08:07:45Z

Finished
--------


+------------------------------------------------------------------------------+
| Cleanup                                      Thu, 23 Jan 2025 08:07:45 +0000 |
+------------------------------------------------------------------------------+

Purging /build/libbio-eutilities-perl-dg2Fbv
Not cleaning session: cloned chroot in use
E: Build failure (dpkg-buildpackage died with exit 2)

+------------------------------------------------------------------------------+
| Summary                                      Thu, 23 Jan 2025 08:07:46 +0000 |
+------------------------------------------------------------------------------+

Build Architecture: amd64
Build Type: full
Build-Space: 1728
Build-Time: 5
Distribution: sid
Fail-Stage: build
Host Architecture: amd64
Install-Time: 9
Job: /srv/debomatic/incoming/libbio-eutilities-perl_1.77-2.dsc
Machine Architecture: amd64
Package: libbio-eutilities-perl
Package-Time: 16
Source-Version: 1.77-2
Space: 1728
Status: attempted
Version: 1.77-2
--------------------------------------------------------------------------------
Finished at 2025-01-23T08:07:45Z
Build needed 00:00:16, 1728k disk space