sbuild (Debian sbuild) 0.88.2 (16 January 2025) on carme.larted.org.uk

+==============================================================================+
| check-all-the-things 2017.05.20+nmu1 (amd64) Mon, 20 Jan 2025 16:47:19 +0000 |
+==============================================================================+

Package: check-all-the-things
Version: 2017.05.20+nmu1
Source Version: 2017.05.20+nmu1
Distribution: perl-5.40-throwaway
Machine Architecture: amd64
Host Architecture: amd64
Build Architecture: amd64
Build Type: full

I: Setting up the chroot...
I: Creating chroot session...
I: Setting up log color...

+------------------------------------------------------------------------------+
| Chroot Setup Commands                        Mon, 20 Jan 2025 16:47:20 +0000 |
+------------------------------------------------------------------------------+


/usr/share/debomatic/sbuildcommands/chroot-setup-commands/dpkg-speedup check-all-the-things_2017.05.20+nmu1 perl-5.40-throwaway amd64
-------------------------------------------------------------------------------------------------------------------------------------


I: Finished running '/usr/share/debomatic/sbuildcommands/chroot-setup-commands/dpkg-speedup check-all-the-things_2017.05.20+nmu1 perl-5.40-throwaway amd64'.

Finished processing commands.
--------------------------------------------------------------------------------
I: Setting up apt archive...

+------------------------------------------------------------------------------+
| Update chroot                                Mon, 20 Jan 2025 16:47:20 +0000 |
+------------------------------------------------------------------------------+

Get:1 file:/srv/reprepro perl-5.40 InRelease [3030 B]
Get:2 http://deb.debian.org/debian unstable InRelease [205 kB]
Get:3 http://localhost:3142/debian sid InRelease [205 kB]
Get:1 file:/srv/reprepro perl-5.40 InRelease [3030 B]
Get:4 http://deb.debian.org/debian unstable/main amd64 Packages.diff/Index [63.6 kB]
Get:5 http://deb.debian.org/debian unstable/main amd64 Packages T-2025-01-20-1416.52-F-2025-01-20-0805.29.pdiff [25.4 kB]
Get:6 http://localhost:3142/debian sid/main Sources.diff/Index [63.6 kB]
Get:5 http://deb.debian.org/debian unstable/main amd64 Packages T-2025-01-20-1416.52-F-2025-01-20-0805.29.pdiff [25.4 kB]
Get:7 file:/srv/reprepro perl-5.40/main amd64 Packages [8875 B]
Get:8 http://localhost:3142/debian sid/main Sources T-2025-01-20-1416.52-F-2025-01-20-0805.29.pdiff [31.8 kB]
Get:8 http://localhost:3142/debian sid/main Sources T-2025-01-20-1416.52-F-2025-01-20-0805.29.pdiff [31.8 kB]
Fetched 595 kB in 4s (167 kB/s)
Reading package lists...
Reading package lists...
Building dependency tree...
Reading state information...
Calculating upgrade...
0 upgraded, 0 newly installed, 0 to remove and 0 not upgraded.

+------------------------------------------------------------------------------+
| Fetch source files                           Mon, 20 Jan 2025 16:47:26 +0000 |
+------------------------------------------------------------------------------+


Local sources
-------------

/srv/debomatic/incoming/check-all-the-things_2017.05.20+nmu1.dsc exists in /srv/debomatic/incoming; copying to chroot

+------------------------------------------------------------------------------+
| Install package build dependencies           Mon, 20 Jan 2025 16:47:27 +0000 |
+------------------------------------------------------------------------------+


Setup apt archive
-----------------

Merged Build-Depends: bash-completion, debhelper (>= 9), help2man, python3-argcomplete, python3, python3-apt, build-essential
Filtered Build-Depends: bash-completion, debhelper (>= 9), help2man, python3-argcomplete, python3, python3-apt, build-essential
dpkg-deb: building package 'sbuild-build-depends-main-dummy' in '/build/check-all-the-things-MTWhqh/resolver-FEX0pC/apt_archive/sbuild-build-depends-main-dummy.deb'.
Ign:1 copy:/build/check-all-the-things-MTWhqh/resolver-FEX0pC/apt_archive ./ InRelease
Get:2 copy:/build/check-all-the-things-MTWhqh/resolver-FEX0pC/apt_archive ./ Release [609 B]
Ign:3 copy:/build/check-all-the-things-MTWhqh/resolver-FEX0pC/apt_archive ./ Release.gpg
Get:4 copy:/build/check-all-the-things-MTWhqh/resolver-FEX0pC/apt_archive ./ Sources [663 B]
Get:5 copy:/build/check-all-the-things-MTWhqh/resolver-FEX0pC/apt_archive ./ Packages [702 B]
Fetched 1974 B in 0s (91.8 kB/s)
Reading package lists...
Reading package lists...

Install main build dependencies (apt-based resolver)
----------------------------------------------------

Installing build dependencies
Reading package lists...
Building dependency tree...
Reading state information...
The following additional packages will be installed:
  autoconf automake autopoint autotools-dev bash-completion bsdextrautils
  debhelper dh-autoreconf dh-strip-nondeterminism distro-info-data dwz file
  gettext gettext-base groff-base help2man intltool-debian libarchive-zip-perl
  libdebhelper-perl libelf1t64 libexpat1 libfile-stripnondeterminism-perl
  libicu72 liblocale-gettext-perl libmagic-mgc libmagic1t64 libpipeline1
  libpython3-stdlib libpython3.13-minimal libpython3.13-stdlib libtool
  libuchardet0 libxml2 m4 man-db media-types netbase po-debconf
  python-apt-common python3 python3-apt python3-argcomplete python3-minimal
  python3.13 python3.13-minimal sensible-utils tzdata
Suggested packages:
  autoconf-archive gnu-standards autoconf-doc dh-make gettext-doc
  libasprintf-dev libgettextpo-dev groff libtool-doc gfortran
  | fortran95-compiler gcj-jdk m4-doc apparmor less www-browser
  libmail-box-perl python3-doc python3-tk python3-venv python-apt-doc
  python3.13-venv python3.13-doc binfmt-support
Recommended packages:
  curl | wget | lynx libarchive-cpio-perl libltdl-dev libmail-sendmail-perl
  lsb-release iso-codes ca-certificates
The following NEW packages will be installed:
  autoconf automake autopoint autotools-dev bash-completion bsdextrautils
  debhelper dh-autoreconf dh-strip-nondeterminism distro-info-data dwz file
  gettext gettext-base groff-base help2man intltool-debian libarchive-zip-perl
  libdebhelper-perl libelf1t64 libexpat1 libfile-stripnondeterminism-perl
  libicu72 liblocale-gettext-perl libmagic-mgc libmagic1t64 libpipeline1
  libpython3-stdlib libpython3.13-minimal libpython3.13-stdlib libtool
  libuchardet0 libxml2 m4 man-db media-types netbase po-debconf
  python-apt-common python3 python3-apt python3-argcomplete python3-minimal
  python3.13 python3.13-minimal sbuild-build-depends-main-dummy sensible-utils
  tzdata
0 upgraded, 48 newly installed, 0 to remove and 0 not upgraded.
Need to get 27.1 MB of archives.
After this operation, 105 MB of additional disk space will be used.
Get:1 copy:/build/check-all-the-things-MTWhqh/resolver-FEX0pC/apt_archive ./ sbuild-build-depends-main-dummy 0.invalid.0 [884 B]
Get:2 http://deb.debian.org/debian unstable/main amd64 liblocale-gettext-perl amd64 1.07-7+b1 [15.3 kB]
Get:3 http://deb.debian.org/debian unstable/main amd64 libpython3.13-minimal amd64 3.13.1-3 [858 kB]
Get:4 http://deb.debian.org/debian unstable/main amd64 libexpat1 amd64 2.6.4-1 [106 kB]
Get:5 http://deb.debian.org/debian unstable/main amd64 python3.13-minimal amd64 3.13.1-3 [2202 kB]
Get:6 http://deb.debian.org/debian unstable/main amd64 python3-minimal amd64 3.13.1-2 [27.0 kB]
Get:7 http://deb.debian.org/debian unstable/main amd64 media-types all 10.1.0 [26.9 kB]
Get:8 http://deb.debian.org/debian unstable/main amd64 netbase all 6.4 [12.8 kB]
Get:9 http://deb.debian.org/debian unstable/main amd64 tzdata all 2025a-1 [259 kB]
Get:10 http://deb.debian.org/debian unstable/main amd64 libpython3.13-stdlib amd64 3.13.1-3 [1973 kB]
Get:11 http://deb.debian.org/debian unstable/main amd64 python3.13 amd64 3.13.1-3 [740 kB]
Get:12 http://deb.debian.org/debian unstable/main amd64 libpython3-stdlib amd64 3.13.1-2 [9952 B]
Get:13 http://deb.debian.org/debian unstable/main amd64 python3 amd64 3.13.1-2 [28.0 kB]
Get:14 http://deb.debian.org/debian unstable/main amd64 sensible-utils all 0.0.24 [24.8 kB]
Get:15 http://deb.debian.org/debian unstable/main amd64 bash-completion all 1:2.16.0-6 [319 kB]
Get:16 http://deb.debian.org/debian unstable/main amd64 libmagic-mgc amd64 1:5.45-3+b1 [314 kB]
Get:17 http://deb.debian.org/debian unstable/main amd64 libmagic1t64 amd64 1:5.45-3+b1 [108 kB]
Get:18 http://deb.debian.org/debian unstable/main amd64 file amd64 1:5.45-3+b1 [43.3 kB]
Get:19 http://deb.debian.org/debian unstable/main amd64 gettext-base amd64 0.23.1-1 [243 kB]
Get:20 http://deb.debian.org/debian unstable/main amd64 libuchardet0 amd64 0.0.8-1+b2 [68.9 kB]
Get:21 http://deb.debian.org/debian unstable/main amd64 groff-base amd64 1.23.0-7 [1185 kB]
Get:22 http://deb.debian.org/debian unstable/main amd64 bsdextrautils amd64 2.40.4-1 [92.2 kB]
Get:23 http://deb.debian.org/debian unstable/main amd64 libpipeline1 amd64 1.5.8-1 [42.0 kB]
Get:24 http://deb.debian.org/debian unstable/main amd64 man-db amd64 2.13.0-1 [1420 kB]
Get:25 http://deb.debian.org/debian unstable/main amd64 m4 amd64 1.4.19-5 [294 kB]
Get:26 http://deb.debian.org/debian unstable/main amd64 autoconf all 2.72-3 [493 kB]
Get:27 http://deb.debian.org/debian unstable/main amd64 autotools-dev all 20220109.1 [51.6 kB]
Get:28 http://deb.debian.org/debian unstable/main amd64 automake all 1:1.16.5-1.3 [823 kB]
Get:29 http://deb.debian.org/debian unstable/main amd64 autopoint all 0.23.1-1 [770 kB]
Get:30 http://deb.debian.org/debian unstable/main amd64 libdebhelper-perl all 13.24.1 [90.9 kB]
Get:31 http://deb.debian.org/debian unstable/main amd64 libtool all 2.5.4-2 [539 kB]
Get:32 http://deb.debian.org/debian unstable/main amd64 dh-autoreconf all 20 [17.1 kB]
Get:33 http://deb.debian.org/debian unstable/main amd64 libarchive-zip-perl all 1.68-1 [104 kB]
Get:34 http://deb.debian.org/debian unstable/main amd64 libfile-stripnondeterminism-perl all 1.14.0-1 [19.5 kB]
Get:35 http://deb.debian.org/debian unstable/main amd64 dh-strip-nondeterminism all 1.14.0-1 [8448 B]
Get:36 http://deb.debian.org/debian unstable/main amd64 libelf1t64 amd64 0.192-4 [189 kB]
Get:37 http://deb.debian.org/debian unstable/main amd64 dwz amd64 0.15-1+b1 [110 kB]
Get:38 http://deb.debian.org/debian unstable/main amd64 libicu72 amd64 72.1-6 [9421 kB]
Get:39 http://deb.debian.org/debian unstable/main amd64 libxml2 amd64 2.12.7+dfsg+really2.9.14-0.2+b1 [699 kB]
Get:40 http://deb.debian.org/debian unstable/main amd64 gettext amd64 0.23.1-1 [1680 kB]
Get:41 http://deb.debian.org/debian unstable/main amd64 intltool-debian all 0.35.0+20060710.6 [22.9 kB]
Get:42 http://deb.debian.org/debian unstable/main amd64 po-debconf all 1.0.21+nmu1 [248 kB]
Get:43 http://deb.debian.org/debian unstable/main amd64 debhelper all 13.24.1 [920 kB]
Get:44 http://deb.debian.org/debian unstable/main amd64 distro-info-data all 0.63 [6408 B]
Get:45 http://deb.debian.org/debian unstable/main amd64 help2man amd64 1.49.3 [198 kB]
Get:46 http://deb.debian.org/debian unstable/main amd64 python-apt-common all 2.9.6 [67.9 kB]
Get:47 http://deb.debian.org/debian unstable/main amd64 python3-apt amd64 2.9.6+b1 [173 kB]
Get:48 http://deb.debian.org/debian unstable/main amd64 python3-argcomplete all 3.5.3-1 [40.4 kB]
Preconfiguring packages ...
Fetched 27.1 MB in 0s (111 MB/s)
Selecting previously unselected package liblocale-gettext-perl.
(Reading database ... 23043 files and directories currently installed.)
Preparing to unpack .../liblocale-gettext-perl_1.07-7+b1_amd64.deb ...
Unpacking liblocale-gettext-perl (1.07-7+b1) ...
Selecting previously unselected package libpython3.13-minimal:amd64.
Preparing to unpack .../libpython3.13-minimal_3.13.1-3_amd64.deb ...
Unpacking libpython3.13-minimal:amd64 (3.13.1-3) ...
Selecting previously unselected package libexpat1:amd64.
Preparing to unpack .../libexpat1_2.6.4-1_amd64.deb ...
Unpacking libexpat1:amd64 (2.6.4-1) ...
Selecting previously unselected package python3.13-minimal.
Preparing to unpack .../python3.13-minimal_3.13.1-3_amd64.deb ...
Unpacking python3.13-minimal (3.13.1-3) ...
Setting up libpython3.13-minimal:amd64 (3.13.1-3) ...
Setting up libexpat1:amd64 (2.6.4-1) ...
Setting up python3.13-minimal (3.13.1-3) ...
Selecting previously unselected package python3-minimal.
(Reading database ... 23392 files and directories currently installed.)
Preparing to unpack .../0-python3-minimal_3.13.1-2_amd64.deb ...
Unpacking python3-minimal (3.13.1-2) ...
Selecting previously unselected package media-types.
Preparing to unpack .../1-media-types_10.1.0_all.deb ...
Unpacking media-types (10.1.0) ...
Selecting previously unselected package netbase.
Preparing to unpack .../2-netbase_6.4_all.deb ...
Unpacking netbase (6.4) ...
Selecting previously unselected package tzdata.
Preparing to unpack .../3-tzdata_2025a-1_all.deb ...
Unpacking tzdata (2025a-1) ...
Selecting previously unselected package libpython3.13-stdlib:amd64.
Preparing to unpack .../4-libpython3.13-stdlib_3.13.1-3_amd64.deb ...
Unpacking libpython3.13-stdlib:amd64 (3.13.1-3) ...
Selecting previously unselected package python3.13.
Preparing to unpack .../5-python3.13_3.13.1-3_amd64.deb ...
Unpacking python3.13 (3.13.1-3) ...
Selecting previously unselected package libpython3-stdlib:amd64.
Preparing to unpack .../6-libpython3-stdlib_3.13.1-2_amd64.deb ...
Unpacking libpython3-stdlib:amd64 (3.13.1-2) ...
Setting up python3-minimal (3.13.1-2) ...
Selecting previously unselected package python3.
(Reading database ... 24365 files and directories currently installed.)
Preparing to unpack .../00-python3_3.13.1-2_amd64.deb ...
Unpacking python3 (3.13.1-2) ...
Selecting previously unselected package sensible-utils.
Preparing to unpack .../01-sensible-utils_0.0.24_all.deb ...
Unpacking sensible-utils (0.0.24) ...
Selecting previously unselected package bash-completion.
Preparing to unpack .../02-bash-completion_1%3a2.16.0-6_all.deb ...
Unpacking bash-completion (1:2.16.0-6) ...
Selecting previously unselected package libmagic-mgc.
Preparing to unpack .../03-libmagic-mgc_1%3a5.45-3+b1_amd64.deb ...
Unpacking libmagic-mgc (1:5.45-3+b1) ...
Selecting previously unselected package libmagic1t64:amd64.
Preparing to unpack .../04-libmagic1t64_1%3a5.45-3+b1_amd64.deb ...
Unpacking libmagic1t64:amd64 (1:5.45-3+b1) ...
Selecting previously unselected package file.
Preparing to unpack .../05-file_1%3a5.45-3+b1_amd64.deb ...
Unpacking file (1:5.45-3+b1) ...
Selecting previously unselected package gettext-base.
Preparing to unpack .../06-gettext-base_0.23.1-1_amd64.deb ...
Unpacking gettext-base (0.23.1-1) ...
Selecting previously unselected package libuchardet0:amd64.
Preparing to unpack .../07-libuchardet0_0.0.8-1+b2_amd64.deb ...
Unpacking libuchardet0:amd64 (0.0.8-1+b2) ...
Selecting previously unselected package groff-base.
Preparing to unpack .../08-groff-base_1.23.0-7_amd64.deb ...
Unpacking groff-base (1.23.0-7) ...
Selecting previously unselected package bsdextrautils.
Preparing to unpack .../09-bsdextrautils_2.40.4-1_amd64.deb ...
Unpacking bsdextrautils (2.40.4-1) ...
Selecting previously unselected package libpipeline1:amd64.
Preparing to unpack .../10-libpipeline1_1.5.8-1_amd64.deb ...
Unpacking libpipeline1:amd64 (1.5.8-1) ...
Selecting previously unselected package man-db.
Preparing to unpack .../11-man-db_2.13.0-1_amd64.deb ...
Unpacking man-db (2.13.0-1) ...
Selecting previously unselected package m4.
Preparing to unpack .../12-m4_1.4.19-5_amd64.deb ...
Unpacking m4 (1.4.19-5) ...
Selecting previously unselected package autoconf.
Preparing to unpack .../13-autoconf_2.72-3_all.deb ...
Unpacking autoconf (2.72-3) ...
Selecting previously unselected package autotools-dev.
Preparing to unpack .../14-autotools-dev_20220109.1_all.deb ...
Unpacking autotools-dev (20220109.1) ...
Selecting previously unselected package automake.
Preparing to unpack .../15-automake_1%3a1.16.5-1.3_all.deb ...
Unpacking automake (1:1.16.5-1.3) ...
Selecting previously unselected package autopoint.
Preparing to unpack .../16-autopoint_0.23.1-1_all.deb ...
Unpacking autopoint (0.23.1-1) ...
Selecting previously unselected package libdebhelper-perl.
Preparing to unpack .../17-libdebhelper-perl_13.24.1_all.deb ...
Unpacking libdebhelper-perl (13.24.1) ...
Selecting previously unselected package libtool.
Preparing to unpack .../18-libtool_2.5.4-2_all.deb ...
Unpacking libtool (2.5.4-2) ...
Selecting previously unselected package dh-autoreconf.
Preparing to unpack .../19-dh-autoreconf_20_all.deb ...
Unpacking dh-autoreconf (20) ...
Selecting previously unselected package libarchive-zip-perl.
Preparing to unpack .../20-libarchive-zip-perl_1.68-1_all.deb ...
Unpacking libarchive-zip-perl (1.68-1) ...
Selecting previously unselected package libfile-stripnondeterminism-perl.
Preparing to unpack .../21-libfile-stripnondeterminism-perl_1.14.0-1_all.deb ...
Unpacking libfile-stripnondeterminism-perl (1.14.0-1) ...
Selecting previously unselected package dh-strip-nondeterminism.
Preparing to unpack .../22-dh-strip-nondeterminism_1.14.0-1_all.deb ...
Unpacking dh-strip-nondeterminism (1.14.0-1) ...
Selecting previously unselected package libelf1t64:amd64.
Preparing to unpack .../23-libelf1t64_0.192-4_amd64.deb ...
Unpacking libelf1t64:amd64 (0.192-4) ...
Selecting previously unselected package dwz.
Preparing to unpack .../24-dwz_0.15-1+b1_amd64.deb ...
Unpacking dwz (0.15-1+b1) ...
Selecting previously unselected package libicu72:amd64.
Preparing to unpack .../25-libicu72_72.1-6_amd64.deb ...
Unpacking libicu72:amd64 (72.1-6) ...
Selecting previously unselected package libxml2:amd64.
Preparing to unpack .../26-libxml2_2.12.7+dfsg+really2.9.14-0.2+b1_amd64.deb ...
Unpacking libxml2:amd64 (2.12.7+dfsg+really2.9.14-0.2+b1) ...
Selecting previously unselected package gettext.
Preparing to unpack .../27-gettext_0.23.1-1_amd64.deb ...
Unpacking gettext (0.23.1-1) ...
Selecting previously unselected package intltool-debian.
Preparing to unpack .../28-intltool-debian_0.35.0+20060710.6_all.deb ...
Unpacking intltool-debian (0.35.0+20060710.6) ...
Selecting previously unselected package po-debconf.
Preparing to unpack .../29-po-debconf_1.0.21+nmu1_all.deb ...
Unpacking po-debconf (1.0.21+nmu1) ...
Selecting previously unselected package debhelper.
Preparing to unpack .../30-debhelper_13.24.1_all.deb ...
Unpacking debhelper (13.24.1) ...
Selecting previously unselected package distro-info-data.
Preparing to unpack .../31-distro-info-data_0.63_all.deb ...
Unpacking distro-info-data (0.63) ...
Selecting previously unselected package help2man.
Preparing to unpack .../32-help2man_1.49.3_amd64.deb ...
Unpacking help2man (1.49.3) ...
Selecting previously unselected package python-apt-common.
Preparing to unpack .../33-python-apt-common_2.9.6_all.deb ...
Unpacking python-apt-common (2.9.6) ...
Selecting previously unselected package python3-apt.
Preparing to unpack .../34-python3-apt_2.9.6+b1_amd64.deb ...
Unpacking python3-apt (2.9.6+b1) ...
Selecting previously unselected package python3-argcomplete.
Preparing to unpack .../35-python3-argcomplete_3.5.3-1_all.deb ...
Unpacking python3-argcomplete (3.5.3-1) ...
Selecting previously unselected package sbuild-build-depends-main-dummy.
Preparing to unpack .../36-sbuild-build-depends-main-dummy_0.invalid.0_amd64.deb ...
Unpacking sbuild-build-depends-main-dummy (0.invalid.0) ...
Setting up media-types (10.1.0) ...
Setting up libpipeline1:amd64 (1.5.8-1) ...
Setting up libicu72:amd64 (72.1-6) ...
Setting up bsdextrautils (2.40.4-1) ...
Setting up libmagic-mgc (1:5.45-3+b1) ...
Setting up libarchive-zip-perl (1.68-1) ...
Setting up distro-info-data (0.63) ...
Setting up libdebhelper-perl (13.24.1) ...
Setting up libmagic1t64:amd64 (1:5.45-3+b1) ...
Setting up gettext-base (0.23.1-1) ...
Setting up m4 (1.4.19-5) ...
Setting up file (1:5.45-3+b1) ...
Setting up libelf1t64:amd64 (0.192-4) ...
Setting up tzdata (2025a-1) ...

Current default time zone: 'Etc/UTC'
Local time is now:      Mon Jan 20 16:47:37 UTC 2025.
Universal Time is now:  Mon Jan 20 16:47:37 UTC 2025.
Run 'dpkg-reconfigure tzdata' if you wish to change it.

Setting up autotools-dev (20220109.1) ...
Setting up bash-completion (1:2.16.0-6) ...

Setting up autopoint (0.23.1-1) ...
Setting up autoconf (2.72-3) ...
Setting up dwz (0.15-1+b1) ...
Setting up python-apt-common (2.9.6) ...
Setting up sensible-utils (0.0.24) ...
Setting up libuchardet0:amd64 (0.0.8-1+b2) ...
Setting up netbase (6.4) ...
Configuration file '/etc/protocols'
 ==> File on system created by you or by a script.
 ==> File also in package provided by package maintainer.
 ==> Using current old file as you requested.

Configuration file '/etc/services'
 ==> File on system created by you or by a script.
 ==> File also in package provided by package maintainer.
 ==> Using current old file as you requested.
Setting up libpython3.13-stdlib:amd64 (3.13.1-3) ...
Setting up libxml2:amd64 (2.12.7+dfsg+really2.9.14-0.2+b1) ...
Setting up liblocale-gettext-perl (1.07-7+b1) ...
Setting up libpython3-stdlib:amd64 (3.13.1-2) ...
Setting up automake (1:1.16.5-1.3) ...
update-alternatives: using /usr/bin/automake-1.16 to provide /usr/bin/automake (automake) in auto mode
Setting up libfile-stripnondeterminism-perl (1.14.0-1) ...
Setting up gettext (0.23.1-1) ...
Setting up libtool (2.5.4-2) ...
Setting up python3.13 (3.13.1-3) ...
Setting up python3 (3.13.1-2) ...
Setting up intltool-debian (0.35.0+20060710.6) ...
Setting up help2man (1.49.3) ...
Setting up dh-autoreconf (20) ...
Setting up dh-strip-nondeterminism (1.14.0-1) ...
Setting up groff-base (1.23.0-7) ...
Setting up python3-argcomplete (3.5.3-1) ...
Setting up python3-apt (2.9.6+b1) ...
Setting up po-debconf (1.0.21+nmu1) ...
Setting up man-db (2.13.0-1) ...
Not building database; man-db/auto-update is not 'true'.
Setting up debhelper (13.24.1) ...
Setting up sbuild-build-depends-main-dummy (0.invalid.0) ...
Processing triggers for libc-bin (2.40-5) ...

+------------------------------------------------------------------------------+
| Check architectures                          Mon, 20 Jan 2025 16:47:39 +0000 |
+------------------------------------------------------------------------------+

Arch check ok (amd64 included in all)

+------------------------------------------------------------------------------+
| Build environment                            Mon, 20 Jan 2025 16:47:40 +0000 |
+------------------------------------------------------------------------------+

Kernel: Linux 6.11.10-amd64 #1 SMP PREEMPT_DYNAMIC Debian 6.11.10-1 (2024-11-23) amd64 (x86_64)
Toolchain package versions: binutils_2.43.50.20250108-1 dpkg-dev_1.22.14 g++-13_13.3.0-12 g++-14_14.2.0-14 gcc-13_13.3.0-12 gcc-14_14.2.0-14 libc6-dev_2.40-5 libstdc++-13-dev_13.3.0-12 libstdc++-14-dev_14.2.0-14 libstdc++6_14.2.0-14 linux-libc-dev_6.12.10-1
Package versions: adduser_3.137 apt_2.9.23 autoconf_2.72-3 automake_1:1.16.5-1.3 autopoint_0.23.1-1 autotools-dev_20220109.1 base-files_13.6 base-passwd_3.6.6 bash_5.2.37-1 bash-completion_1:2.16.0-6 binutils_2.43.50.20250108-1 binutils-common_2.43.50.20250108-1 binutils-x86-64-linux-gnu_2.43.50.20250108-1 bsdextrautils_2.40.4-1 bsdutils_1:2.40.4-1 build-essential_12.12 bzip2_1.0.8-6 coreutils_9.5-1+b1 cpp_4:14.2.0-1 cpp-13_13.3.0-12 cpp-13-x86-64-linux-gnu_13.3.0-12 cpp-14_14.2.0-14 cpp-14-x86-64-linux-gnu_14.2.0-14 cpp-x86-64-linux-gnu_4:14.2.0-1 dash_0.5.12-11 debconf_1.5.89 debhelper_13.24.1 debian-archive-keyring_2023.4 debianutils_5.21 dh-autoreconf_20 dh-strip-nondeterminism_1.14.0-1 diffutils_1:3.10-2 dirmngr_2.2.46-1+b1 distro-info-data_0.63 dpkg_1.22.14 dpkg-dev_1.22.14 dwz_0.15-1+b1 eatmydata_131-2 file_1:5.45-3+b1 findutils_4.10.0-3 g++_4:14.2.0-1 g++-13_13.3.0-12 g++-13-x86-64-linux-gnu_13.3.0-12 g++-14_14.2.0-14 g++-14-x86-64-linux-gnu_14.2.0-14 g++-x86-64-linux-gnu_4:14.2.0-1 gcc_4:14.2.0-1 gcc-13_13.3.0-12 gcc-13-base_13.3.0-12 gcc-13-x86-64-linux-gnu_13.3.0-12 gcc-14_14.2.0-14 gcc-14-base_14.2.0-14 gcc-14-x86-64-linux-gnu_14.2.0-14 gcc-x86-64-linux-gnu_4:14.2.0-1 gettext_0.23.1-1 gettext-base_0.23.1-1 gnupg_2.2.46-1 gnupg-l10n_2.2.46-1 gnupg-utils_2.2.46-1+b1 gpg_2.2.46-1+b1 gpg-agent_2.2.46-1+b1 gpg-wks-client_2.2.46-1+b1 gpgconf_2.2.46-1+b1 gpgsm_2.2.46-1+b1 gpgv_2.2.46-1+b1 grep_3.11-4 groff-base_1.23.0-7 gzip_1.13-1 help2man_1.49.3 hostname_3.25 init-system-helpers_1.68 intltool-debian_0.35.0+20060710.6 libacl1_2.3.2-2+b1 libapt-pkg6.0t64_2.9.23 libarchive-zip-perl_1.68-1 libasan8_14.2.0-14 libassuan0_2.5.6-1+b1 libassuan9_3.0.1-2 libatomic1_14.2.0-14 libattr1_1:2.5.2-2 libaudit-common_1:4.0.2-2 libaudit1_1:4.0.2-2+b1 libbinutils_2.43.50.20250108-1 libblkid1_2.40.4-1 libbsd0_0.12.2-2 libbz2-1.0_1.0.8-6 libc-bin_2.40-5 libc-dev-bin_2.40-5 libc-l10n_2.40-5 libc6_2.40-5 libc6-dev_2.40-5 libcap-ng0_0.8.5-4 libcap2_1:2.66-5+b1 libcc1-0_14.2.0-14 libcrypt-dev_1:4.4.38-1 libcrypt1_1:4.4.38-1 libctf-nobfd0_2.43.50.20250108-1 libctf0_2.43.50.20250108-1 libdb5.3t64_5.3.28+dfsg2-9 libdebconfclient0_0.277 libdebhelper-perl_13.24.1 libdpkg-perl_1.22.14 libeatmydata1_131-2+b1 libelf1t64_0.192-4 libexpat1_2.6.4-1 libffi8_3.4.6-1 libfile-stripnondeterminism-perl_1.14.0-1 libgcc-13-dev_13.3.0-12 libgcc-14-dev_14.2.0-14 libgcc-s1_14.2.0-14 libgcrypt20_1.11.0-7 libgdbm-compat4t64_1.24-2 libgdbm6t64_1.24-2 libgmp10_2:6.3.0+dfsg-3 libgnutls30t64_3.8.8-2 libgomp1_14.2.0-14 libgpg-error0_1.51-3 libgprofng0_2.43.50.20250108-1 libhogweed6t64_3.10-1+b1 libhwasan0_14.2.0-14 libicu72_72.1-6 libidn2-0_2.3.7-2+b1 libisl23_0.27-1 libitm1_14.2.0-14 libjansson4_2.14-2+b3 libksba8_1.6.7-2+b1 libldap-2.5-0_2.5.19+dfsg-1 libldap2_2.6.9+dfsg-1 liblocale-gettext-perl_1.07-7+b1 liblsan0_14.2.0-14 liblz4-1_1.9.4-4 liblzma5_5.6.3-1+b1 libmagic-mgc_1:5.45-3+b1 libmagic1t64_1:5.45-3+b1 libmd0_1.1.0-2+b1 libmount1_2.40.4-1 libmpc3_1.3.1-1+b3 libmpfr6_4.2.1-1+b2 libncursesw6_6.5-2+b1 libnettle8t64_3.10-1+b1 libnpth0t64_1.8-2 libp11-kit0_0.25.5-3 libpam-modules_1.5.3-7+b1 libpam-modules-bin_1.5.3-7+b1 libpam-runtime_1.5.3-7 libpam0g_1.5.3-7+b1 libpcre2-8-0_10.44-5 libperl5.38t64_5.38.2-5 libperl5.40_5.40.1-1 libpipeline1_1.5.8-1 libpython3-stdlib_3.13.1-2 libpython3.13-minimal_3.13.1-3 libpython3.13-stdlib_3.13.1-3 libquadmath0_14.2.0-14 libreadline8t64_8.2-6 libsasl2-2_2.1.28+dfsg1-8+b1 libsasl2-modules-db_2.1.28+dfsg1-8+b1 libseccomp2_2.5.5-2 libselinux1_3.7-3+b1 libsemanage-common_3.7-2 libsemanage2_3.7-2+b1 libsepol2_3.7-1 libsframe1_2.43.50.20250108-1 libsmartcols1_2.40.4-1 libsqlite3-0_3.46.1-1 libssl3t64_3.4.0-2 libstdc++-13-dev_13.3.0-12 libstdc++-14-dev_14.2.0-14 libstdc++6_14.2.0-14 libsystemd0_257.2-2 libtasn1-6_4.19.0-3+b3 libtinfo6_6.5-2+b1 libtool_2.5.4-2 libtsan2_14.2.0-14 libubsan1_14.2.0-14 libuchardet0_0.0.8-1+b2 libudev1_257.2-2 libunistring5_1.3-1 libuuid1_2.40.4-1 libxml2_2.12.7+dfsg+really2.9.14-0.2+b1 libxxhash0_0.8.3-2 libzstd1_1.5.6+dfsg-2 linux-libc-dev_6.12.10-1 locales-all_2.40-5 login_1:4.16.0-2+really2.40.4-1 login.defs_1:4.16.0-7 m4_1.4.19-5 make_4.4.1-1 man-db_2.13.0-1 mawk_1.3.4.20240905-1 media-types_10.1.0 ncurses-base_6.5-2 ncurses-bin_6.5-2+b1 netbase_6.4 openssl-provider-legacy_3.4.0-2 passwd_1:4.16.0-7 patch_2.7.6-7 perl_5.40.1-1 perl-base_5.40.1-1 perl-modules-5.38_5.38.2-5 perl-modules-5.40_5.40.1-1 pinentry-curses_1.3.1-2 po-debconf_1.0.21+nmu1 python-apt-common_2.9.6 python3_3.13.1-2 python3-apt_2.9.6+b1 python3-argcomplete_3.5.3-1 python3-minimal_3.13.1-2 python3.13_3.13.1-3 python3.13-minimal_3.13.1-3 readline-common_8.2-6 rpcsvc-proto_1.4.3-1 sbuild-build-depends-main-dummy_0.invalid.0 sed_4.9-2 sensible-utils_0.0.24 sqv_1.2.1-5 sysvinit-utils_3.13-1 tar_1.35+dfsg-3.1 tzdata_2025a-1 usr-is-merged_39+nmu2 util-linux_2.40.4-1 xz-utils_5.6.3-1+b1 zlib1g_1:1.3.dfsg+really1.3.1-1+b1

+------------------------------------------------------------------------------+
| Build                                        Mon, 20 Jan 2025 16:47:40 +0000 |
+------------------------------------------------------------------------------+


Unpack source
-------------

-----BEGIN PGP SIGNED MESSAGE-----
Hash: SHA256

Format: 3.0 (native)
Source: check-all-the-things
Binary: check-all-the-things
Architecture: all
Version: 2017.05.20+nmu1
Maintainer: Paul Wise <pabs@debian.org>
Standards-Version: 3.9.8
Vcs-Browser: https://anonscm.debian.org/cgit/collab-maint/check-all-the-things.git
Vcs-Git: https://anonscm.debian.org/git/collab-maint/check-all-the-things.git
Build-Depends: bash-completion, debhelper (>= 9), help2man, python3-argcomplete, python3, python3-apt
Package-List:
 check-all-the-things deb devel optional arch=all
Checksums-Sha1:
 8f313a35e898049b1b29f28361db53ca7dae234a 33484 check-all-the-things_2017.05.20+nmu1.tar.xz
Checksums-Sha256:
 c97224dffcea0e1ef2dd0aeae8f6023b3283d1f45f2a739db903c7b56d068cdb 33484 check-all-the-things_2017.05.20+nmu1.tar.xz
Files:
 950b2f050e4a100b150963b51250f712 33484 check-all-the-things_2017.05.20+nmu1.tar.xz

-----BEGIN PGP SIGNATURE-----

iQIzBAEBCAAdFiEEufrTGSrz5KUwnZ05h588mTgBqU8FAl3sKlYACgkQh588mTgB
qU8RXw/8D4JbUvmrtPLA9D8FD/waDKzer808JxrDyOQKPUMXljesYtfIzn2b285I
hTyMkH+z/1ak5EQCSQ04Hc0Hb5SYst3tJc6SLgRaLe4hPDSiZqhh1QggfEU12fss
cTJIHo0DoyQG64j1xV6BCbYZE/tsYWvUzAG2ug18oeLTaZVowwsb6SIjX/hFKZVu
p/lfeh1u+EuGDwu1Z15clOzM1U3yIuZfbGddWiyiKj17ZhXg5Yrkl48r+d7E+kMf
Gr/ROJuoj0m4OL9XRE03oGUF40si7125vvaSCkXe5k/BisBbid7R09Z7M/F8HgR3
/5eHP+ySqzsmmiT3P198FqTBa4ZqqqgjRZjYkOQrXHi9ZiO0i+XvGaj7S7eFUosy
sfQr7H5m4kfTV/GH+EwMUGIo5Cv77+qT33ozCy3d9wXO8sWYT1cgPbLwLvKqDKtd
VC0Y+DgLj087RHqlMt5J6IXT50NH7IYg3jzv6qmc/uFAJsmKZZws3fSxzR4bXSaz
5iV3U8hGYA44P/QKDJNGFby1BTconraNpUht018gqNonMMSOmLEnRaPektJjq5tk
WTD9ycfG+Y0a7P8A50d+cSz+pP4d7rzOcsNRCAI82dkSYyLKqNLA3FSPvvnWyrtB
mRjo+OxF5RtrcCCtCy4ZQqGed7IFzlm8u2b6dO4STLB0w4QcKxg=
=Oxw7
-----END PGP SIGNATURE-----

gpgv: Signature made Sat Dec  7 22:40:22 2019 UTC
gpgv:                using RSA key B9FAD3192AF3E4A5309D9D39879F3C993801A94F
gpgv: Can't check signature: No public key
dpkg-source: warning: cannot verify inline signature for ./check-all-the-things_2017.05.20+nmu1.dsc: no acceptable signature found
dpkg-source: info: extracting check-all-the-things in /build/check-all-the-things-MTWhqh/check-all-the-things-2017.05.20+nmu1
dpkg-source: info: unpacking check-all-the-things_2017.05.20+nmu1.tar.xz

Check disk space
----------------

Sufficient free space for build

+------------------------------------------------------------------------------+
| Starting Timed Build Commands                Mon, 20 Jan 2025 16:47:40 +0000 |
+------------------------------------------------------------------------------+


/usr/share/debomatic/sbuildcommands/starting-build-commands/no-network check-all-the-things_2017.05.20+nmu1 perl-5.40-throwaway amd64
-------------------------------------------------------------------------------------------------------------------------------------


I: Finished running '/usr/share/debomatic/sbuildcommands/starting-build-commands/no-network check-all-the-things_2017.05.20+nmu1 perl-5.40-throwaway amd64'.

Finished processing commands.
--------------------------------------------------------------------------------

User Environment
----------------

APT_CONFIG=/var/lib/sbuild/apt.conf
HOME=/sbuild-nonexistent
LANG=en_GB.UTF-8
LANGUAGE=en_GB:en
LC_ALL=C.UTF-8
LD_LIBRARY_PATH=/usr/lib/libeatmydata
LD_PRELOAD=libeatmydata.so
LOGNAME=debomatic
PATH=/usr/local/sbin:/usr/local/bin:/usr/sbin:/usr/bin:/sbin:/bin:/usr/games
PWD=/build/check-all-the-things-MTWhqh/check-all-the-things-2017.05.20+nmu1
SCHROOT_ALIAS_NAME=perl-5.40-throwaway-amd64-debomatic
SCHROOT_CHROOT_NAME=perl-5.40-amd64-debomatic
SCHROOT_COMMAND=env
SCHROOT_GID=110
SCHROOT_GROUP=sbuild
SCHROOT_SESSION_ID=perl-5.40-amd64-debomatic-e50cbb14-0f86-4145-8db8-71c58302e67a
SCHROOT_UID=1002
SCHROOT_USER=debomatic
SHELL=/bin/sh
USER=debomatic

dpkg-buildpackage
-----------------

Command: dpkg-buildpackage --sanitize-env -us -uc
dpkg-buildpackage: info: source package check-all-the-things
dpkg-buildpackage: info: source version 2017.05.20+nmu1
dpkg-buildpackage: info: source distribution unstable
dpkg-buildpackage: info: source changed by Sandro Tosi <morph@debian.org>
 dpkg-source --before-build .
dpkg-buildpackage: info: host architecture amd64
 debian/rules clean
dh clean --parallel --with bash-completion
dh: warning: Compatibility levels before 10 are deprecated (level 9 in use)
   dh_auto_clean -O--parallel
dh_auto_clean: warning: Compatibility levels before 10 are deprecated (level 9 in use)
   dh_clean -O--parallel
dh_clean: warning: Compatibility levels before 10 are deprecated (level 9 in use)
 dpkg-source -b .
dpkg-source: info: using source format '3.0 (native)'
dpkg-source: info: building check-all-the-things in check-all-the-things_2017.05.20+nmu1.tar.xz
dpkg-source: info: building check-all-the-things in check-all-the-things_2017.05.20+nmu1.dsc
 debian/rules binary
dh binary --parallel --with bash-completion
dh: warning: Compatibility levels before 10 are deprecated (level 9 in use)
   dh_update_autotools_config -O--parallel
   dh_auto_configure -O--parallel
dh_auto_configure: warning: Compatibility levels before 10 are deprecated (level 9 in use)
   debian/rules override_dh_auto_build
make[1]: Entering directory '/build/check-all-the-things-MTWhqh/check-all-the-things-2017.05.20+nmu1'
help2man \
	--version-string=2017.05.20+nmu1 \
	--no-info \
	--name="Check all of the things!" \
	./check-all-the-things \
	> check-all-the-things.1
register-python-argcomplete3 check-all-the-things > debian/check-all-the-things.bash-completion
/bin/sh: 1: register-python-argcomplete3: not found
make[1]: *** [debian/rules:15: override_dh_auto_build] Error 127
make[1]: Leaving directory '/build/check-all-the-things-MTWhqh/check-all-the-things-2017.05.20+nmu1'
make: *** [debian/rules:7: binary] Error 2
dpkg-buildpackage: error: debian/rules binary subprocess returned exit status 2
--------------------------------------------------------------------------------
Build finished at 2025-01-20T16:47:43Z

Finished
--------


+------------------------------------------------------------------------------+
| Cleanup                                      Mon, 20 Jan 2025 16:47:43 +0000 |
+------------------------------------------------------------------------------+

Purging /build/check-all-the-things-MTWhqh
Not cleaning session: cloned chroot in use
E: Build failure (dpkg-buildpackage died with exit 2)

+------------------------------------------------------------------------------+
| Summary                                      Mon, 20 Jan 2025 16:47:44 +0000 |
+------------------------------------------------------------------------------+

Build Architecture: amd64
Build Type: full
Build-Space: 504
Build-Time: 3
Distribution: perl-5.40-throwaway
Fail-Stage: build
Host Architecture: amd64
Install-Time: 12
Job: /srv/debomatic/incoming/check-all-the-things_2017.05.20+nmu1.dsc
Machine Architecture: amd64
Package: check-all-the-things
Package-Time: 24
Source-Version: 2017.05.20+nmu1
Space: 504
Status: attempted
Version: 2017.05.20+nmu1
--------------------------------------------------------------------------------
Finished at 2025-01-20T16:47:43Z
Build needed 00:00:24, 504k disk space